{"text_format":"1","workbook":"xlsx","n_sheets":13,"sheets":["Cover","Change Log","Objectives","CDH - DataBudget & Mass Storage","CDH -Single Master","Distributed - ADCS board","Distributed - Payload Board","Distributed - TT&C","Radiation Hardness","CDH -Distributed","ProductTreeMain","Trade_off","Constants"],"not_rendered":{"charts":4,"images":7,"macros":1,"external_links":15,"defined_names":551,"comments":7,"pivot_tables":0},"unopened":[],"bounds":{"document_bytes":16777216,"sheet_cells":100000,"rows_first":2000,"rows_last":500,"rows_between":2000,"halvings":0,"cell_chars":16384,"cell_head_chars":4096},"cells_cut":0,"cells_raw":0,"read":"whole","date_system":"1900"}

{"sheet":"Cover","index":0,"n_rows":0,"n_cols":0,"rows_kept":0,"cut":false,"hidden":false,"merged":[]}

{"sheet":"Change Log","index":1,"n_rows":1,"n_cols":7,"rows_kept":1,"cut":false,"hidden":false,"merged":[]}
["Institution","Name","Date","File version","Sheet Name","Change","Reason for Change"]

{"sheet":"Objectives","index":2,"n_rows":0,"n_cols":0,"rows_kept":0,"cut":false,"hidden":false,"merged":[]}

{"sheet":"CDH - DataBudget & Mass Storage","index":3,"n_rows":111,"n_cols":16,"rows_kept":111,"cut":false,"hidden":false,"merged":[[39,0,39,7],[5,10,5,15],[5,0,5,3],[12,0,12,3],[5,4,5,7],[18,0,18,7],[27,0,27,3],[33,0,33,3],[33,4,33,7]]}
[]
[]
[]
[null,null,null,null,null,null,"All the formulas in the worksheet are based on Space mission analysis and Design third edition ( On board compter chapter)"]
[]
["Input from OCDT",null,null,null,"OBC architecture",null,null,null,null,null,"House keeping"]
["Payload data rate",null,60000,"bit/sec","Type of architecture",null,"Centralized Single Processor (Single Master)",null,null,null,"Item","Quantity","Telemetry Type","Frequency[Hz]","Word Size single or double[bit]","Required Data Rate[bps]"]
["Downlink data rate telemetry and ADCS channel",null,125,"bit/sec","Data protocol",null,"RS422",null,null,null,"Power"]
["Downlink data rate payload channel",null,600,"bit/sec","I/O bus type",null,"RS422",{"$f":"IF(VLOOKUP(G9,A101:B111,2,FALSE)<MAX(C14,C7,C15),\"Not Comply\",\"Comply\")","v":"Comply"},null,null,"Voltage Sensor",1,"Voltage",1,8,{"$f":"O9*N9*L9","v":8}]
["Payload duty cycle ( Worst Case)",null,0.3,"%","Operating system",null,"LINUX",null,null,null,"Power bus voltage Sensor",1,"Voltage",1,8,{"$f":"O10*N10*L10","v":8}]
["Ground station access in a day",null,800,"Min","Number of payload dedicated processors",null,{"$f":"IF(F11=\"\",1,F11)","v":1},"-",null,null,"Battery Charge Sensor",1,"Voltage",1,8,8]
["Orbit period",null,60,"Min","Number of ADCS dedicated processors",null,{"$f":"IF(F12=\"\",1,F12)","v":1},"-",null,null,"Power Mnt",1,null,1,8,8]
["Data estimated from spacecraft equipment",null,null,null,"Number of  House Keeping dedicated processors",null,1,"-",null,null,"Thermal"]
["House keeping data rate ",null,{"$f":"IF(B14=\"\",P47-SUM(P37:P43),B14)","v":781},"bit/sec","Redundant processors",null,1,"-"]
["ADCS data rate",null,{"$f":"IF(B15=\"\",SUM(P37:P43),B15)","v":1200},"bit/sec","Payload data processing",null,"On Board",null,null,null,"PRT sensor",2,"Temperature",0.1,16,3.2]
{"$rows_left_out":97}
{"sheet":"CDH -Single Master","index":4,"n_rows":122,"n_cols":11,"rows_kept":122,"cut":false,"hidden":false,"merged":[[6,0,6,3],[6,5,6,10],[16,0,16,3]]}
[]
[]
[]
[]
[]
[]
["Single OBC Processor",null,null,null,null,"CSC(Computer software components)"]
["Payload data rate",null,{"$f":"'CDH - DataBudget & Mass Storage'!C7*0.125","v":7500},"Byte/sec",null,"Function","Is the function required?","Advanced Programming language (from assembly) ","Complexity vs SOA","SLOC","Typical Execution Frequency [Hz]"]
["Software line of codes",null,{"$f":"K64","v":156810},"SLOC",null,"Communication"]
["CPU frequency",400,{"$f":"IF(B10=\"\",\"\",B10)","v":400},"MHz",null,"Command Processing",1,1,1,{"$f":"IF(AND(H10=1),G10*(Constants!N116+(Constants!N116*I10)+(Constants!N116*0.25)),G10*Constants!N116+Constants!N116*I10)","v":2250},10]
["OBC throughput ",null,{"$f":"IF(B12=\"\",ROUND((C10/(G14*I14+G25*I25+G36*I36+G43*I43+G57*I57+G63*I63+G49*I49)),0),\"\")","v":145},"MIPS",null,"Telemetry processing",1,1,1,{"$f":"IF(AND(H11=1),G11*(Constants!N117+(Constants!N117*I11)+(Constants!N117*0.25)),G11*Constants!N117+Constants!N117*I11)","v":2250},10]
["Throughput (with payload)",null,{"$f":"IF(B12=\"\",ROUND((C10/(G14*I14+G25*I25+G36*I36+G43*I43+G57*I57+G63*I63+G49*I49))+('CDH -Distributed'!C8*'CDH -Distributed'!C9/100)*'CDH - DataBudget & Mass Storage'!F16,0),\"\")","v":175},"MIPS",null,"Telemetry processing (with compression)",1,1,1,{"$f":"IF(AND(H12=1),G12*(Constants!N118+(Constants!N118*I12)+(Constants!N118*0.25)),G12*Constants!N118+Constants!N118*I12)","v":7875}]
["Data Protocol",null,"MIL-STD-1553",null,null,"Total",{"$f":"SUM(J10:J12)","v":12375},"Margin",1,"Total with Margin",{"$f":"G13+G13*I13","v":24750}]
["I/O ",null,"MIL-STD-1553",{"$f":"IF(VLOOKUP(C14,A118:B122,2,FALSE)<MAX('CDH - DataBudget & Mass Storage'!C14,'CDH - DataBudget & Mass Storage'!C7,'CDH - DataBudget & Mass Storage'!C15),\"Not Comply\",\"Comply\")","v":"Comply"},null,"Percent of available processing",{"$f":"(G13/$G$64)","v":9.4700593074421274E-2},"Clock Cycles",10]
[null,null,null,null,null,"Sensor"]
{"$rows_left_out":108}
{"sheet":"Distributed - ADCS board","index":5,"n_rows":122,"n_cols":11,"rows_kept":122,"cut":false,"hidden":true,"merged":[[6,0,6,3],[6,5,6,10],[14,0,14,3]]}
[]
[]
[]
[]
[]
[]
["ADCS Processor",null,null,null,null,"CSC(Computer software components)"]
["Software line of codes",null,{"$f":"K64","v":120510},"SLOC",null,"Function","Is the function required?","Advanced Programming language (from assembly) ","Complexity vs SOA","SLOC","Typical Execution Frequency [Hz]"]
["CPU frequency",5,{"$f":"IF(B9=\"\",\"\",B9)","v":5},"MHz",null,"Communication"]
["OBC throughput ",null,{"$f":"IF(B10=\"\",ROUND((C9/(G14*I14+G25*I25+G36*I36+G43*I43+G57*I57+G63*I63+G49*I49)),0),\"\")","v":2},"MIPS",null,"Command Processing",0,1,1,{"$f":"IF(AND(H10=1),G10*(Constants!N116+(Constants!N116*I10)+(Constants!N116*0.25)),G10*Constants!N116+Constants!N116*I10)","v":0},10]
["Data protocol",null,"MIL-STD-1553",null,null,"Telemetry processing",1,1,1,{"$f":"IF(AND(H11=1),G11*(Constants!N117+(Constants!N117*I11)+(Constants!N117*0.25)),G11*Constants!N117+Constants!N117*I11)","v":2250},10]
["I/O ",null,"MIL-STD-1553",{"$f":"IF(VLOOKUP(C12,A118:B122,2,FALSE)<'CDH - DataBudget & Mass Storage'!C15,\"Not Comply\",\"Comply\")","v":"Comply"},null,"Telemetry processing (with compression)",0,1,1,{"$f":"IF(AND(H12=1),G12*(Constants!N118+(Constants!N118*I12)+(Constants!N118*0.25)),G12*Constants!N118+Constants!N118*I12)","v":0}]
[null,null,null,null,null,"Total",{"$f":"SUM(J10:J12)","v":2250},"Margin",1,"Total with Margin",{"$f":"G13+G13*I13","v":4500}]
[null,null,null,null,null,"Percent of available processing",{"$f":"(G13/$G$64)","v":2.2404779686333084E-2},"Clock Cycles",10]
["Output to OCDT",null,null,null,null,"Sensor"]
{"$rows_left_out":108}
{"sheet":"Distributed - Payload Board","index":6,"n_rows":122,"n_cols":11,"rows_kept":122,"cut":false,"hidden":true,"merged":[[6,0,6,3],[6,5,6,10],[15,0,15,3]]}
[]
[]
[]
[]
[]
[]
["Payload  Processor",null,null,null,null,"CSC(Computer software components)"]
["Payload Data Rate",null,{"$f":"'CDH - DataBudget & Mass Storage'!C7*0.125","v":7500},"Byte/sec",null,"Function","Is the function required?","Advanced Programming language (from assembly) ","Complexity vs SOA","SLOC","Typical Execution Frequency [Hz]"]
["Software line of codes",null,{"$f":"K64","v":82680},"SLOC",null,"Communication"]
["CPU frequency",400,{"$f":"IF(B10=\"\",\"\",B10)","v":400},"MHz",null,"Command Processing",1,1,1,{"$f":"IF(AND(H10=1),G10*(Constants!N116+(Constants!N116*I10)+(Constants!N116*0.25)),G10*Constants!N116+Constants!N116*I10)","v":2250},10]
["OBC throughput ",null,{"$f":"IF(B12=\"\",ROUND((C10/(G14*I14+G25*I25+G36*I36+G43*I43+G57*I57+G63*I63+G49*I49)),0),\"\")","v":159},"MIPS",null,"Telemetry processing",1,1,1,{"$f":"IF(AND(H11=1),G11*(Constants!N117+(Constants!N117*I11)+(Constants!N117*0.25)),G11*Constants!N117+Constants!N117*I11)","v":2250},10]
["Throughput (with Payload data)",null,{"$f":"IF(B12=\"\",ROUND((C10/(G14*I14+G25*I25+G36*I36+G43*I43+G57*I57+G63*I63+G49*I49))+('CDH -Distributed'!C8*'CDH -Distributed'!C9/100)*'CDH - DataBudget & Mass Storage'!F16,0),\"\")","v":189},"MIPS",null,"Telemetry processing (with compression)",0,1,1,{"$f":"IF(AND(H12=1),G12*(Constants!N118+(Constants!N118*I12)+(Constants!N118*0.25)),G12*Constants!N118+Constants!N118*I12)","v":0}]
["Data protocol",null,"MIL-STD-1553",null,null,"Total",{"$f":"SUM(J10:J12)","v":4500},"Margin",1,"Total with Margin",{"$f":"G13+G13*I13","v":9000}]
["I/O ",null,"MIL-STD-1553",{"$f":"IF(VLOOKUP(C14,A118:B122,2,FALSE)<'CDH - DataBudget & Mass Storage'!C7,\"Not Comply\",\"Comply\")","v":"Comply"},null,"Percent of available processing",{"$f":"(G13/$G$64)","v":6.5312046444121918E-2},"Clock Cycles",10]
[null,null,null,null,null,"Sensor"]
{"$rows_left_out":108}
{"sheet":"Distributed - TT&C","index":7,"n_rows":122,"n_cols":11,"rows_kept":122,"cut":false,"hidden":true,"merged":[[6,0,6,3],[6,5,6,10],[13,0,13,3]]}
[]
[]
[]
[]
[]
[]
["TT&C Processor",null,null,null,null,"CSC(Computer software components)"]
["Software line of codes",null,{"$f":"K64","v":64830},"SLOC",null,"Function","Is the function required?","Advanced Programming language (from assembly) ","Complexity vs SOA","SLOC","Typical Execution Frequency [Hz]"]
["CPU frequency",2,{"$f":"IF(B9=\"\",\"\",B9)","v":2},"MHz",null,"Communication"]
["Throughput ",null,{"$f":"IF(B10=\"\",ROUND((C9/(G14*I14+G25*I25+G36*I36+G43*I43+G57*I57+G63*I63+G49*I49)),0),\"\")","v":1},"MIPS",null,"Command Processing",1,1,1,{"$f":"IF(AND(H10=1),G10*(Constants!N116+(Constants!N116*I10)+(Constants!N116*0.25)),G10*Constants!N116+Constants!N116*I10)","v":2250},10]
["Data protocol",null,"MIL-STD-1553",null,null,"Telemetry processing",1,1,1,{"$f":"IF(AND(H11=1),G11*(Constants!N117+(Constants!N117*I11)+(Constants!N117*0.25)),G11*Constants!N117+Constants!N117*I11)","v":2250},10]
["I/O ",null,"MIL-STD-1553",{"$f":"IF(VLOOKUP(C12,A118:B122,2,FALSE)<'CDH - DataBudget & Mass Storage'!C14,\"Not Comply\",\"Comply\")","v":"Comply"},null,"Telemetry processing (with compression)",1,1,1,{"$f":"IF(AND(H12=1),G12*(Constants!N118+(Constants!N118*I12)+(Constants!N118*0.25)),G12*Constants!N118+Constants!N118*I12)","v":7875}]
[null,null,null,null,null,"Total",{"$f":"SUM(J10:J12)","v":12375},"Margin",1,"Total with Margin",{"$f":"G13+G13*I13","v":24750}]
["Output to OCDT",null,null,null,null,"Percent of available processing",{"$f":"(G13/$G$64)","v":0.22906062008329478},"Clock Cycles",10]
["TT&C board frequency ",null,{"$f":"IF(B15=\"\",C9,B15)","v":2},"Hz",null,"Sensor"]
{"$rows_left_out":108}
{"sheet":"Radiation Hardness","index":8,"n_rows":31,"n_cols":23,"rows_kept":31,"cut":false,"hidden":false,"merged":[[7,14,8,16],[7,17,8,19],[7,20,8,22]]}
[]
[]
[]
[]
[]
[]
[]
[null,null,null,null,null,null,null,null,null,null,null,null,null,"Shielding","Total Dose (kRad) at 700 km",null,null,"Total Dose (kRad) at 1000 km ",null,null,"Total Dose (kRad) at 2000 km"]
[null,null,null,null,null,null,null,null,null,null,null,null,null,"Thickness"]
[null,null,null,null,null,null,null,null,null,null,null,null,null,"mil AL","1 yr","5 yrs","12 yrs","1 yr","3 yrs","5 yrs","1 yr","5 yrs","12 yrs"]
[null,null,null,null,null,null,null,null,null,null,null,null,null,50,7.16,{"$f":"5*O11","v":35.799999999999997},{"$f":"12*O11","v":85.92},14,{"$f":"3*R11","v":42},{"$f":"5*R11","v":70},164.68,{"$f":"5*U11","v":823.40000000000009},{"$f":"12*U11","v":1976.16}]
[null,null,null,null,null,null,null,null,null,null,null,null,null,{"$f":"10+N11","v":60},5.51,{"$f":"5*O12","v":27.549999999999997},{"$f":"12*O12","v":66.12},11,{"$f":"3*R12","v":33},{"$f":"5*R12","v":55},125.63,{"$f":"5*U12","v":628.15},{"$f":"12*U12","v":1507.56}]
[null,null,null,null,null,null,null,null,null,null,null,null,null,{"$f":"10+N12","v":70},4.33,21.65,51.96,8.8000000000000007,26.400000000000002,44,97.86,489.3,1174.32]
[null,null,null,null,null,null,null,null,null,null,null,null,null,80,3.58,17.899999999999999,42.96,7,21,35,80.19,400.95,962.28]
[null,null,null,null,null,null,null,null,null,null,null,null,null,90,2.96,14.8,35.519999999999996,5.8,17.399999999999999,29,65.709999999999994,328.54999999999995,788.52]
{"$rows_left_out":17}
{"sheet":"CDH -Distributed","index":9,"n_rows":112,"n_cols":16384,"rows_kept":112,"cut":false,"hidden":true,"merged":[[22,0,22,3],[6,5,6,10],[6,0,6,3],[14,0,14,3]]}
[]
[]
[]
[]
[]
[]
["Payload processing unit ",null,null,null,null,"CSC(Computer software componets)"]
["Payload Data Rate",null,{"$f":"'CDH - DataBudget & Mass Storage'!C7*0.125","v":7500},"Byte/sec",null,"Processes","Is the process required?","Programming Language different from assembly ","Complexity vs SOA","SLOC","Typical Exectution Frequency [Hz]"]
["Number of instructions per byte",null,{"$f":"IF(B9=\"\",1,\"\")","v":1},null,null,"Communication"]
["CPU frequency",400,{"$f":"IF(B10=\"\",\"\",B10)","v":400},"KHz",null,"Command Processing",1,1,1,{"$f":"IF(AND(H10=1),G10*(Constants!N116+(Constants!N116*I10)+(Constants!N116*0.25)),G10*Constants!N116+Constants!N116*I10)","v":2250},10]
["Estimated throughtput ",null,{"$f":"IF(B11=\"\",ROUND(((C10/(G14+G57*I57+G63*I63))+C8*C9)/'CDH - DataBudget & Mass Storage'!G11,0),\"\")","v":9386},"KIPS",null,"Telemetry processing",1,1,1,{"$f":"IF(AND(H11=1),G11*(Constants!N117+(Constants!N117*I11)+(Constants!N117*0.25)),G11*Constants!N117+Constants!N117*I11)","v":2250},10]
["Data protocol",null,"I2C",null,null,"Telemetry processing (with compression)",1,1,1,{"$f":"IF(AND(H12=1),G12*(Constants!N118+(Constants!N118*I12)+(Constants!N118*0.25)),G12*Constants!N118+Constants!N118*I12)","v":7875}]
["I/O bus",null,"RS485",{"$f":"IF(VLOOKUP(C13,A106:B112,2,FALSE)<'CDH - DataBudget & Mass Storage'!C7,\"Not Comply\",\"Comply\")","v":"Comply"},null,"Total",{"$f":"SUM(J10:J12)","v":12375},"Margin",1,"Total with Margin",{"$f":"G13+G13*I13","v":24750}]
[null,null,null,null,null,"Pecent of avaiable processing",{"$f":"(G13/$G$64)","v":4.7350296537210637E-2},"Clock Cycles",10]
["Telemetry and health keeping processing unit ",null,null,null,null,"Sensor"]
{"$rows_left_out":98}
{"sheet":"ProductTreeMain","index":10,"n_rows":3,"n_cols":1,"rows_kept":3,"cut":false,"hidden":false,"merged":[]}
[1]
[1]
[1]

{"sheet":"Trade_off","index":11,"n_rows":52,"n_cols":20,"rows_kept":52,"cut":false,"hidden":false,"merged":[[29,0,30,0],[29,1,30,1],[29,17,30,17],[31,0,40,0]]}
[null,"Trade-off table",null,null,null,null,null,null,null,null,null,null,null,null,null,null,null,null,null,"Version 1.4"]
[null,"1. Fill in the names of the trade-off parameters in the green priority list. Leave empty if no parameter",null,null,null,null,null,null,null,null,null,null,null,null,null,null,null,">",null,"R. Biesbroek"]
[null,"2. Rank the parameters in order of priority and indicate if a parameter is more important (>) or equally important (=) than the next one. ",null,null,null,null,null,null,null,null,null,null,null,null,null,null,null,"=",null,"TEC-SYE"]
[null,"This will automatically create the weight factor definition table.  (replace them if you do not agree with the outcome)",null,null,null,null,null,null,null,null,null,null,null,null,null,null,null,null,null,"Loris Franchi"]
[null,"3. Define the options e.g. replace 'text 1' by 'chemical propulsion platform'",null,null,null,null,null,null,null,null,null,null,null,null,null,null,null,null,null,"Politecnico di Torino"]
[null,"4. Fill in the trade-off table by assigning a score to each option for each key trade-off parameter. Use the same scale, e.g. 1 to 5"]
[null,"5. The bottom row will give the ranking of the options, taking into account the weight factors"]
[null,"Please fill in only the GREEN parts in the tables!"]
[]
[null,"Please insert trade-off parameter names  in the green list and select condition ('>' or '=')from the drop-down menu's: (order in terms of decreasing importance)"]
[null,"Parameter1",null,"parameter2",null,"parameter3",null,"parameter4",null,"parameter5",null,"parameter6",null,"parameter7",null,"parameter8",null,"parameter9",null,"parameter10"]
["Priority List","Mass",">","Cost",">","Power","=","Equilibrium temperature","=","E","=",null,"=",null,"=",null,"=",null,"="]
["Value:",null,{"$f":"IF(C12=\">\",1,0)","v":1},null,{"$f":"IF(E12=\">\",1,0)","v":1},null,{"$f":"IF(G12=\">\",1,0)","v":0},null,{"$f":"IF(I12=\">\",1,0)","v":0},null,{"$f":"IF(K12=\">\",1,0)","v":0},null,{"$f":"IF(M12=\">\",1,0)","v":0},null,{"$f":"IF(O12=\">\",1,0)","v":0},null,{"$f":"IF(Q12=\">\",1,0)","v":0},null,{"$f":"IF(S12=\">\",1,0)","v":0}]
[]
["Key trade-off parameters & weight factor definition. This table is automatically produced and requires no inputs"]
{"$rows_left_out":38}
{"sheet":"Constants","index":12,"n_rows":174,"n_cols":44,"rows_kept":174,"cut":false,"hidden":false,"merged":[[28,4,28,6],[37,4,37,5],[50,4,50,5]]}
["Speed of Light",{"$f":"299792458","v":299792458},"m/s",null,"For constants please refere to Space mission analysis and design third edition"]
["Planck's Constant",{"$f":"6.6260755E-34","v":6.6260755E-34},"W-s^2"]
["Boltzmann's Constant",{"$f":"1.380658E-23","v":1.3806580000000001E-23},"W-s/K",null,"Drag Table",null,"Density",null,null," ","Curve Fit Coefficients"]
["Stefan-Boltzmann Constant",{"$f":"0.0000000567051","v":5.6705100000000003E-8},"W/m^2/K^4",null,"Altitude","Scale Height","Min","Mean","Max",null,"Scale Height",null,"Min",null,"Mean",null,"Max"]
[null,null,null,null,0,8.4,{"$f":"$B$33*1.2*10^0","v":1.2},{"$f":"1.2*10^0*$B$33","v":1.2},{"$f":"1.2*10^0*$B$33","v":1.2},null,{"$f":"LOGEST(F5:F6,E5:E6)","v":0.99647343942365929},8.4,{"$f":"LOGEST(G5:G6,E5:E6)","v":0.86267099598919128},1.2000000000000013,{"$f":"LOGEST(H5:H6,E5:E6)","v":0.86300148430553925},1.2000000000000004,{"$f":"LOGEST(I5:I6,E5:E6)","v":0.86354284336938314},1.2000000000000024]
[null,null,null,null,100,5.9,{"$f":"4.61*10^-7*$B$33","v":4.6100000000000001E-7},{"$f":"4.79*10^-7*$B$33","v":4.7899999999999999E-7},{"$f":"5.1*10^-7*$B$33","v":5.0999999999999999E-7},null,{"$f":"LOGEST(F6:F7,E6:E7)","v":1.0297072329929207},0.31584621299500232,{"$f":"LOGEST(G6:G7,E6:E7)","v":0.89346112401831479},3.5986108723599558E-2,{"$f":"LOGEST(H6:H7,E6:E7)","v":0.89443103759468146},3.3546667989377735E-2,{"$f":"LOGEST(I6:I7,E6:E7)","v":0.89544970934785129},3.1875000000000216E-2]
["Sun - Gravitational Constant",132700000000,"km^3/sec^2",null,150,25.5,{"$f":"1.65*10^-9*$B$33","v":1.6500000000000001E-9},{"$f":"1.81*10^-9*$B$33","v":1.8100000000000002E-9},{"$f":"2.04*10^-9*$B$33","v":2.04E-9},null,{"$f":"LOGEST(F7:F8,E7:E8)","v":1.0077430733560648},8.018015999999994,{"$f":"LOGEST(G7:G8,E7:E8)","v":0.95644218110239376},1.3142432947406164E-6,{"$f":"LOGEST(H7:H8,E7:E8)","v":0.96141045125510749},6.627545774349797E-7,{"$f":"LOGEST(I7:I8,E7:E8)","v":0.96546881378077976},3.9709340956047757E-7]
[null,null,null,null,200,37.5,{"$f":"1.78*10^-10*$B$33","v":1.7800000000000001E-10},{"$f":"2.53*10^-10*$B$33","v":2.5300000000000001E-10},{"$f":"3.52*10^-10*$B$33","v":3.5200000000000003E-10},null,{"$f":"LOGEST(F8:F9,E8:E9)","v":1.0035636789870466},18.409597045466189,{"$f":"LOGEST(G8:G9,E8:E9)","v":0.96714701577121509},1.4187987049891646E-7,{"$f":"LOGEST(H8:H9,E8:E9)","v":0.97239178546508487},6.836979018839576E-8,{"$f":"LOGEST(I8:I9,E8:E9)","v":0.97628195923691496},4.2804542175819242E-8]
["Radius of Earth Orbit around the Sun",149600000,"km",null,250,44.8,{"$f":"3.35*10^-11*$B$33","v":3.3500000000000001E-11},{"$f":"6.24*10^-11*$B$33","v":6.2399999999999999E-11},{"$f":"1.06*10^-10*$B$33","v":1.0600000000000001E-10},null,{"$f":"LOGEST(F9:F10,E9:E10)","v":1.0023186226113339},25.108927269167818,{"$f":"LOGEST(G9:G10,E9:E10)","v":0.97222051708922141},3.8357415185596573E-8,{"$f":"LOGEST(H9:H10,E9:E10)","v":0.97700548171152435},2.0937965568000135E-8,{"$f":"LOGEST(I9:I10,E9:E10)","v":0.98050042536913595},1.456663579927229E-8]
["Earth - Orbital Period",365.25400000000002,"days",null,300,50.3,{"$f":"8.19*10^-12*$B$33","v":8.1899999999999996E-12},{"$f":"1.95*10^-11*$B$33","v":1.9499999999999997E-11},{"$f":"3.96*10^-11*$B$33","v":3.9599999999999998E-11},null,{"$f":"LOGEST(F10:F11,E10:E11)","v":1.0017151715639681},30.08101903544739,{"$f":"LOGEST(G10:G11,E10:E11)","v":0.97525601850620436},1.5055395468750046E-8,{"$f":"LOGEST(H10:H11,E10:E11)","v":0.97966234659641926},9.2706405771136565E-9,{"$f":"LOGEST(I10:I11,E10:E11)","v":0.98285628058069752},7.0907148974368284E-9]
["Earth - Radius",6378.1369999999997,"km",null,350,54.8,{"$f":"2.34*10^-12*$B$33","v":2.3399999999999997E-12},{"$f":"6.98*10^-12*$B$33","v":6.9800000000000006E-12},{"$f":"1.668*10^-11*$B$33","v":1.6679999999999998E-11},null,{"$f":"LOGEST(F11:F12,E11:E12)","v":1.0012046281980518},35.957010369125094,{"$f":"LOGEST(G11:G12,E11:E12)","v":0.97702551278446703},7.9826905087363789E-9,{"$f":"LOGEST(H11:H12,E11:E12)","v":0.98132817847367793},5.1151815532580723E-9,{"$f":"LOGEST(I11:I12,E11:E12)","v":0.98427174476845669},4.2848903122017038E-9]
["Earth - Gravitational Constant",398600.44179999997,"km^3/sec^2",null,400,58.2,{"$f":"0.000000000000732*$B$33","v":7.3200000000000001E-13},{"$f":"0.00000000000272*$B$33","v":2.7200000000000001E-12},{"$f":"0.00000000000755*$B$33","v":7.5500000000000007E-12},null,{"$f":"LOGEST(F12:F13,E12:E13)","v":1.0010384285580636},38.425813069096527,{"$f":"LOGEST(G12:G13,E12:E13)","v":0.97850650567608033},4.3553604537007836E-9,{"$f":"LOGEST(H12:H13,E12:E13)","v":0.98258513759556954},3.0654383649850907E-9,{"$f":"LOGEST(I12:I13,E12:E13)","v":0.98535155208239156},2.7635348737019309E-9]
["Earth - Sidereal Day",{"$f":"23+56/60+4/3600","v":23.934444444444445},"hours",null,450,61.3,{"$f":"0.000000000000247*$B$33","v":2.4700000000000001E-13},{"$f":"0.00000000000113*$B$33","v":1.13E-12},{"$f":"0.00000000000361*$B$33","v":3.6100000000000002E-12},null,{"$f":"LOGEST(F13:F14,E13:E14)","v":1.0010182256573112},38.776384530432807,{"$f":"LOGEST(G13:G14,E13:E14)","v":0.97996730783460739},2.2257813678725773E-9,{"$f":"LOGEST(H13:H14,E13:E14)","v":0.98338732952300345},2.1232674535004475E-9,{"$f":"LOGEST(I13:I14,E13:E14)","v":0.98617799126284589},1.8950447638629697E-9]
["Earth - Solar Day",24,"hours",null,500,64.5,{"$f":"0.0000000000000898*$B$33","v":8.9800000000000006E-14},{"$f":"0.000000000000489*$B$33","v":4.8900000000000004E-13},{"$f":"0.0000000000018*$B$33","v":1.8E-12},null,{"$f":"LOGEST(F14:F15,E14:E15)","v":1.0012624757609592},34.323335891636866,{"$f":"LOGEST(G14:G15,E14:E15)","v":0.98204775184085935},7.7085634766226934E-10,{"$f":"LOGEST(H14:H15,E14:E15)","v":0.98424148961990421},1.3755447178182631E-9,{"$f":"LOGEST(I14:I15,E14:E15)","v":0.98677328788241292},1.4014584573745438E-9]
[null,null,null,null,550,68.7,{"$f":"0.0000000000000363*$B$33","v":3.6300000000000001E-14},{"$f":"0.000000000000221*$B$33","v":2.2099999999999999E-13},{"$f":"0.000000000000925*$B$33","v":9.25E-13},null,{"$f":"LOGEST(F15:F16,E15:E16)","v":1.0017028218724708},26.950279165713035,{"$f":"LOGEST(G15:G16,E15:E16)","v":0.98470933069819921},1.7397121696089749E-10,{"$f":"LOGEST(H15:H16,E15:E16)","v":0.98503762945483397},8.8174001825821176E-10,{"$f":"LOGEST(I15:I16,E15:E16)","v":0.98733229452271587},1.0263685655874676E-9]
{"$rows_left_out":159}