{"text_format":"1","workbook":"xlsx","n_sheets":13,"sheets":["Cover","Change Log","Objectives","CDH - DataBudget & Mass Storage","CDH -Single Master","Distributed - ADCS board","Distributed - Payload Board","Distributed - TT&C","Radiation Hardness","CDH -Distributed","ProductTreeMain","Trade_off","Constants"],"not_rendered":{"charts":4,"images":7,"macros":1,"external_links":15,"defined_names":551,"comments":7,"pivot_tables":0},"unopened":[],"bounds":{"document_bytes":16777216,"sheet_cells":100000,"rows_first":2000,"rows_last":500,"rows_between":2000,"halvings":0,"cell_chars":16384,"cell_head_chars":4096},"cells_cut":0,"cells_raw":0,"read":"whole","date_system":"1900"}

{"sheet":"Cover","index":0,"n_rows":0,"n_cols":0,"rows_kept":0,"cut":false,"hidden":false,"merged":[]}

{"sheet":"Change Log","index":1,"n_rows":1,"n_cols":7,"rows_kept":1,"cut":false,"hidden":false,"merged":[]}
["Institution","Name","Date","File version","Sheet Name","Change","Reason for Change"]

{"sheet":"Objectives","index":2,"n_rows":0,"n_cols":0,"rows_kept":0,"cut":false,"hidden":false,"merged":[]}

{"sheet":"CDH - DataBudget & Mass Storage","index":3,"n_rows":111,"n_cols":16,"rows_kept":111,"cut":false,"hidden":false,"merged":[[39,0,39,7],[5,10,5,15],[5,0,5,3],[12,0,12,3],[5,4,5,7],[18,0,18,7],[27,0,27,3],[33,0,33,3],[33,4,33,7]]}
[]
[]
[]
[null,null,null,null,null,null,"All the formulas in the worksheet are based on Space mission analysis and Design third edition ( On board compter chapter)"]
[]
["Input from OCDT",null,null,null,"OBC architecture",null,null,null,null,null,"House keeping"]
["Payload data rate",null,60000,"bit/sec","Type of architecture",null,"Centralized Single Processor (Single Master)",null,null,null,"Item","Quantity","Telemetry Type","Frequency[Hz]","Word Size single or double[bit]","Required Data Rate[bps]"]
["Downlink data rate telemetry and ADCS channel",null,125,"bit/sec","Data protocol",null,"RS422",null,null,null,"Power"]
["Downlink data rate payload channel",null,600,"bit/sec","I/O bus type",null,"RS422",{"$f":"IF(VLOOKUP(G9,A101:B111,2,FALSE)<MAX(C14,C7,C15),\"Not Comply\",\"Comply\")","v":"Comply"},null,null,"Voltage Sensor",1,"Voltage",1,8,{"$f":"O9*N9*L9","v":8}]
["Payload duty cycle ( Worst Case)",null,0.3,"%","Operating system",null,"LINUX",null,null,null,"Power bus voltage Sensor",1,"Voltage",1,8,{"$f":"O10*N10*L10","v":8}]
["Ground station access in a day",null,800,"Min","Number of payload dedicated processors",null,{"$f":"IF(F11=\"\",1,F11)","v":1},"-",null,null,"Battery Charge Sensor",1,"Voltage",1,8,8]
["Orbit period",null,60,"Min","Number of ADCS dedicated processors",null,{"$f":"IF(F12=\"\",1,F12)","v":1},"-",null,null,"Power Mnt",1,null,1,8,8]
["Data estimated from spacecraft equipment",null,null,null,"Number of  House Keeping dedicated processors",null,1,"-",null,null,"Thermal"]
["House keeping data rate ",null,{"$f":"IF(B14=\"\",P47-SUM(P37:P43),B14)","v":781},"bit/sec","Redundant processors",null,1,"-"]
["ADCS data rate",null,{"$f":"IF(B15=\"\",SUM(P37:P43),B15)","v":1200},"bit/sec","Payload data processing",null,"On Board",null,null,null,"PRT sensor",2,"Temperature",0.1,16,3.2]
["House keeping sampling time ",null,{"$f":"IF(B16=\"\",5,B16)","v":5},"s",{"$f":"IF(G15=\"On Board\",\"Percentage of payload data processed on-board\", \"Data processed on ground\")","v":"Percentage of payload data processed on-board"},0.4,{"$f":"IF(G15=\"Ground\",0,F16)","v":0.4},"%",null,null,"Thermal Control",1,"Heaters",0.1,8,0.8]
[]
[null,null,null,null,null,null,null,null,null,null,"Communication"]
["Data budget",null,null,null,null,null,null,null,null,null,"GPS Power level sensor",1,"Voltage",1,8,8]
["Payload data compression type",null,"Lossless Compression",null,"Data safety margin",null,{"$f":"IF(F20=\"\",50%,F20)","v":0.5},"%",null,null,"GPS temperature sensor",1,"Temperature",1,8,8]
["Data per day payload (always on)",null,{"$f":"(C7*60*60*24*VLOOKUP(C20,B98:C101,2,FALSE))/1000","v":1296000},"Kb/day","Actual payload data in a day",null,{"$f":"(C24*C7*VLOOKUP(C20,B98:C101,2,FALSE))/1000","v":6480},"Kb",null,null,"Antenna Temperature",1,"Temperature",1,8,8]
["ADCS data per day (always on)",null,{"$f":"(C15*60*60*24)/1000","v":103680},"Kb/day","Actual total house keeping and ADCS data ",null,{"$f":"(C26*C14+C15*C26)/1000","v":570.52800000000002},"Kb",null,null,"Transmitter Power",2,"Voltage",1,8,16]
["House keeping data per day ",null,{"$f":"ROUND((C14*60*60*24)/1000,0)","v":67478},"Kb/day","Downlinked data telemetry",null,{"$f":"(C25*C8)/1000","v":100},"Kb",null,null,"Kalman Filter",1,"GPS",0.01,16,0.16]
["Payload on (day) ",null,{"$f":"IF(B24=\"\",((24*60)/(C12))*(C12*C10),B24)","v":432},"Min","Total downlinked data (Payload)",null,{"$f":"(C25*C9)/1000","v":480},"Kb",null,null,"C & DH"]
["Ground station accesses (day)",null,{"$f":"IF(B25=\"\",C11,B25)","v":800},"Min","Required on-board memory with margin",null,{"$f":"IF(F25=\"\",(G21+G22)+(G21+G22)*G20,F25)","v":10575.792000000001},"Kb",null,null,"CPU power level",1,"Voltage",1,8,{"$f":"O25*N25*L25","v":8}]
["House keeping processes (day)",null,{"$f":"(((24*60*60)/(C16)))/60","v":288},"Min","Free memory per day",null,{"$f":"(G25-(G25-((G24+G23))))","v":580},"Kb",null,null,"CPU temperature",1,"Temperature",1,8,8]
[null,null,null,null,null,null,null,null,null,null,"Fault Detection Monitor",1,"Event detection",5,8,40]
["Single on-board mass storage",null,null,null,null,null,null,null,null,null,"Fault Correction",1,"Event Detection",5,8,40]
["Memory",null,{"$f":"G25","v":10575.792000000001},"Kb",null,null,null,null,null,null,"Telemetry processing",1,"System health",10,8,80]
["Memory type",null,"SSD","-",null,null,null,null,null,null,"Command Processing",1,"System Mng",10,8,80]
["Data protocol",null,"RS422"]
["I/O ",null,"I2C"]
[null,null,null,null,null,null,null,null,null,null,"Propulsion"]
["Payload mass storage",null,null,null,"Flight data mass storage",null,null,null,null,null,"Propellant Sensor",4,"Voltage",10,8,320]
["Memory",null,{"$f":"G21","v":6480},"Kb","Memory",null,{"$f":"G22","v":570.52800000000002},"Kb",null,null,"Capacitor Voltage Sensor",8,"Voltage",2,8,128]
["Memory type",null,"SSD",null,"Memory type",null,"SSD",null,null,null,"ADCS"]
["Data protocol",null,"I2C",null,"Data protocol",null,"I2C",null,null,null,"Magnetometer",3,"xyz position",10,16,480]
["I/O ",null,"I2C",null,"I/O ",null,"I2C",null,null,null,"Gyro",3,"xyz position",10,8,240]
[null,null,null,null,null,null,null,null,null,null,"Horizon",1,"Pitch Roll",10,8,80]
["Outputs to OCDT",null,null,null,null,null,null,null,null,null,"Temperature",4,"Temperature",10,8,320]
["On board memory mass [estimated]",null,{"$f":"B41","v":0},"Kg","Total number of processors (k)",null,{"$f":"F41","v":0},"-",null,null,"Thruster Control",8,"Thruster",1,8,64]
["On board memory power [estimated]",null,{"$f":"B42","v":0},"W","Redundant processors (n)",null,{"$f":"F42","v":0},"-",null,null,"Orbit Propagator",1,"Orbit det ",1,8,8]
["Required on-board memory",null,0,"Kb","Redundacy Type","Internal","Internal",null,null,null,"Orbit error detection",1,"Orbit Err",1,8,8]
[null,null,null,null,"Redundacy scheme","Hot","Hot",null,null,null,"Other"]
[null,null,null,null,null,null,null,null,null,null,"Item1"]
[null,null,null,null,null,null,null,null,null,null,"Item2"]
[null,null,null,null,null,null,null,null,null,null,null,null,null,null,"Data rate [bps]",{"$f":" CEILING(SUM(P9:P43),1)","v":1981}]
[]
[]
[]
[]
[]
[]
[null,"HDD",null,null,null,null,null,"Internal","Cold"]
[null,"SSD",null,null,null,null,null,"External","Hot"]
[null,"SD"]
[null,"EDMM"]
[]
[]
[]
[]
[]
[]
[]
[]
[]
[]
[]
[]
[]
[]
[]
[]
[]
[]
[]
[]
[]
[]
[]
[]
[]
["Centralized Single Processor (Single Master)","RS422"]
["Bus Architecture Federated ( Single Master)","RS485",null,null,null,1,"On Board"]
["Distributed - Bus ( Multi Master)","PASTE",null,null,null,0,"Ground"]
["Distributed - Star","CAN"]
["Distributed Ring","MIL-STD-1553"]
[null,"I2C"]
[]
[]
[]
[]
[]
[]
[]
[]
[null,null,"Compression Rate"]
["GNU","None",1]
["LINUX","Lossless Compression",{"$f":"1/4","v":0.25}]
["BSD ","Near-lossless compression",{"$f":"1/30","v":3.3333333333333333E-2}]
["OAR (real-time multiprocessor)","Lossy Compression",{"$f":"1/80","v":1.2500000000000001E-2}]
[]
[]
["Bus I/O","Data Rate"]
["RS422",1000000,"bit/sec"]
["RS422",1000000,"bit/sec"]
["MIL-STD-1553",1000000,"bit/s"]
["I2C",400000,"bit/s"]
["SpireWire",400000000]
["CAN",5000000]
["Time Triggered ( Ethernet)",10000000000]

{"sheet":"CDH -Single Master","index":4,"n_rows":122,"n_cols":11,"rows_kept":122,"cut":false,"hidden":false,"merged":[[6,0,6,3],[6,5,6,10],[16,0,16,3]]}
[]
[]
[]
[]
[]
[]
["Single OBC Processor",null,null,null,null,"CSC(Computer software components)"]
["Payload data rate",null,{"$f":"'CDH - DataBudget & Mass Storage'!C7*0.125","v":7500},"Byte/sec",null,"Function","Is the function required?","Advanced Programming language (from assembly) ","Complexity vs SOA","SLOC","Typical Execution Frequency [Hz]"]
["Software line of codes",null,{"$f":"K64","v":156810},"SLOC",null,"Communication"]
["CPU frequency",400,{"$f":"IF(B10=\"\",\"\",B10)","v":400},"MHz",null,"Command Processing",1,1,1,{"$f":"IF(AND(H10=1),G10*(Constants!N116+(Constants!N116*I10)+(Constants!N116*0.25)),G10*Constants!N116+Constants!N116*I10)","v":2250},10]
["OBC throughput ",null,{"$f":"IF(B12=\"\",ROUND((C10/(G14*I14+G25*I25+G36*I36+G43*I43+G57*I57+G63*I63+G49*I49)),0),\"\")","v":145},"MIPS",null,"Telemetry processing",1,1,1,{"$f":"IF(AND(H11=1),G11*(Constants!N117+(Constants!N117*I11)+(Constants!N117*0.25)),G11*Constants!N117+Constants!N117*I11)","v":2250},10]
["Throughput (with payload)",null,{"$f":"IF(B12=\"\",ROUND((C10/(G14*I14+G25*I25+G36*I36+G43*I43+G57*I57+G63*I63+G49*I49))+('CDH -Distributed'!C8*'CDH -Distributed'!C9/100)*'CDH - DataBudget & Mass Storage'!F16,0),\"\")","v":175},"MIPS",null,"Telemetry processing (with compression)",1,1,1,{"$f":"IF(AND(H12=1),G12*(Constants!N118+(Constants!N118*I12)+(Constants!N118*0.25)),G12*Constants!N118+Constants!N118*I12)","v":7875}]
["Data Protocol",null,"MIL-STD-1553",null,null,"Total",{"$f":"SUM(J10:J12)","v":12375},"Margin",1,"Total with Margin",{"$f":"G13+G13*I13","v":24750}]
["I/O ",null,"MIL-STD-1553",{"$f":"IF(VLOOKUP(C14,A118:B122,2,FALSE)<MAX('CDH - DataBudget & Mass Storage'!C14,'CDH - DataBudget & Mass Storage'!C7,'CDH - DataBudget & Mass Storage'!C15),\"Not Comply\",\"Comply\")","v":"Comply"},null,"Percent of available processing",{"$f":"(G13/$G$64)","v":9.4700593074421274E-2},"Clock Cycles",10]
[null,null,null,null,null,"Sensor"]
[null,null,null,null,null,"Rate Gyro",1,1,0.5,{"$f":"IF(AND(H16=1),G16*(Constants!N124+(Constants!N124*I16)+(Constants!N124*0.25)),G16* Constants!N124+Constants!N124*I16)","v":1400},10]
["Output to OCDT",null,null,null,null,"Sun Sensor",1,1,0.5,{"$f":"IF(AND(H17=1),G17*(Constants!N125+(Constants!N125*I17)+(Constants!N125*0.25)),G17* Constants!N125+Constants!N125*I17)","v":875},1]
["CPU frequency ",null,{"$f":"IF(B18=\"\",C10,B18)","v":400},"Hz",null,"Earth Sensor",1,1,0.5,{"$f":"IF(AND(H18=1),G18*(Constants!N126+(Constants!N126*I18)+(Constants!N126*0.25)),G18* Constants!N126+Constants!N126*I18)","v":2100},2]
["CPU throughput ",null,{"$f":"IF(B19=\"\",C12,B19)","v":175},"MIPS",null,"Magnetometer",1,1,0.5,{"$f":"IF(AND(H19=1),G19*(Constants!N127+(Constants!N127*I19)+(Constants!N127*0.25)),G19* Constants!N127+Constants!N127*I19)","v":350},0.01]
["Board mass [estimated] ",null,{"$f":"B20","v":0},"Kg",null,"Star Tracker (no id)",1,1,0.5,{"$f":"IF(AND(H20=1),G20*(Constants!N128+(Constants!N128*I20)+(Constants!N128*0.25)),G20* Constants!N128+Constants!N128*I20)","v":700},0.01]
["Board power [estimated]",null,{"$f":"B21","v":0},"W",null,"Star tracker output quaternion",1,1,0.5,{"$f":"IF(AND(H21=1),G21*(Constants!N129+(Constants!N129*I21)+(Constants!N129*0.25)),G21* Constants!N129+Constants!N129*I21)","v":3500},1]
[null,null,null,null,null,"GPS(Position/velocity)",1,1,0.5,{"$f":"IF(AND(H22=1),G22*(Constants!N130+(Constants!N130*I22)+(Constants!N130*0.25)),G22* Constants!N130+Constants!N130*I22)","v":525},1]
[null,null,null,null,null,"GPS(Pseudo Range)",1,1,0.5,{"$f":"IF(AND(H23=1),G23*(Constants!N131+(Constants!N131*I23)+(Constants!N131*0.25)),G23* Constants!N131+Constants!N131*I23)","v":4375}]
[null,null,null,null,null,"Total",{"$f":"SUM(J16:J23)","v":13825},"Margin",1,"Total with Margin",{"$f":"G24+G24*I24","v":27650}]
[null,null,null,null,null,"Percent of available processing",{"$f":"(G24/$G$64)","v":0.10579682418213124},"Clock Cycles",2]
[null,null,null,null,null,"AOCS"]
[null,null,null,null,null,"Kinetic integration",1,1,0.5,{"$f":"IF(AND(H27=1),G27*(Constants!N136+(Constants!N136*I27)+(Constants!N136*0.25)),G27*Constants!N136+Constants!N136*I27)","v":3500},10]
[null,null,null,null,null,"Kalman Filter",1,1,0.5,{"$f":"IF(AND(H28=1),G28*(Constants!N137+(Constants!N137*I28)+(Constants!N137*0.25)),G28*Constants!N137+Constants!N137*I28)","v":14000},0.01]
[null,null,null,null,null,"Error Determination",1,1,0.5,{"$f":"IF(AND(H29=1),G29*(Constants!N138+(Constants!N138*I29)+(Constants!N138*0.25)),G29*Constants!N138+Constants!N138*I29)","v":1400},10]
[null,null,null,null,null,"Process Control",1,1,0.5,{"$f":"IF(AND(H30=1),G30*(Constants!N139+(Constants!N139*I30)+(Constants!N139*0.25)),G30*Constants!N139+Constants!N139*I30)","v":6125},2]
[null,null,null,null,null,"Ephemerisis Propagator",1,1,0.5,{"$f":"IF(AND(H31=1),G31*(Constants!N140+(Constants!N140*I31)+(Constants!N140*0.25)),G31*Constants!N140+Constants!N140*I31)","v":3500},2]
[null,null,null,null,null,"Complex Ephemerisis",1,1,0.5,{"$f":"IF(AND(H32=1),G32*(Constants!N141+(Constants!N141*I32)+(Constants!N141*0.25)),G32*Constants!N141+Constants!N141*I32)","v":7000},2]
[null,null,null,null,null,"Orbit Propagator (Linear)",1,1,0.5,{"$f":"IF(AND(H33=1),G33*(Constants!N142+(Constants!N142*I33)+(Constants!N142*0.25)),G33*Constants!N142+Constants!N142*I33)","v":5250},1]
[null,null,null,null,null,"Orbit Propagator (Complex Environment)",1,1,0.5,{"$f":"IF(AND(H34=1),G34*(Constants!N143+(Constants!N143*I34)+(Constants!N143*0.25)),G34*Constants!N143+Constants!N143*I34)","v":14875},2]
[null,null,null,null,null,"Total",{"$f":"SUM(J27:J34)","v":55650},"Margin",1,"Total with Margin",{"$f":"G35+G35*I35","v":111300}]
[null,null,null,null,null,"Percent of available processing",{"$f":"(G35/$G$64)","v":0.42586569734073082},"Clock Cycles",2]
[null,null,null,null,null,"Actuator"]
[null,null,null,null,null,"Magnetic control",1,1,0.5,{"$f":"IF(AND(H38=1),G38*(Constants!N148+(Constants!N148*I38)+(Constants!N148*0.25)),G38*Constants!N148+Constants!N148*I38)","v":1050},2]
[null,null,null,null,null,"Thruster Control",1,1,0.5,{"$f":"IF(AND(H39=1),G39*(Constants!N149+(Constants!N149*I39)+(Constants!N149*0.25)),G39*Constants!N149+Constants!N149*I39)","v":1400},2]
[null,null,null,null,null,"Reaction wheel control",1,1,0.5,{"$f":"IF(AND(H40=1),G40*(Constants!N150+(Constants!N150*I40)+(Constants!N150*0.25)),G40*Constants!N150+Constants!N150*I40)","v":2100},2]
[null,null,null,null,null,"CMG control",1,1,0.5,{"$f":"IF(AND(H41=1),G41*(Constants!N151+(Constants!N151*I41)+(Constants!N151*0.25)),G41*Constants!N151+Constants!N151*I41)","v":2625},10]
[null,null,null,null,null,"Total",{"$f":"SUM(J38:J41)","v":7175},"Margin",1,"Total with Margin",{"$f":"G42+G42*I42","v":14350}]
[null,null,null,null,null,"Percent of available processing",{"$f":"(G42/$G$64)","v":5.4907212550220012E-2},"Clock Cycles",2]
[null,null,null,null,null,"FDIR"]
[null,null,null,null,null,"Monitor",1,1,0.5,{"$f":"IF(AND(H45=1),G45*(Constants!N156+(Constants!N156*I45)+(Constants!N156*0.25)),G45*Constants!N156+Constants!N156*I45)","v":7000},5]
[null,null,null,null,null,"Fault identification",1,1,0.5,{"$f":"IF(AND(H46=1),G46*(Constants!N157+(Constants!N157*I46)+(Constants!N157*0.25)),G46*Constants!N157+Constants!N157*I46)","v":4375},5]
[null,null,null,null,null,"Fault Correction",1,1,0.5,{"$f":"IF(AND(H47=1),G47*(Constants!N158+(Constants!N158*I47)+(Constants!N158*0.25)),G47*Constants!N158+Constants!N158*I47)","v":8750},5]
[null,null,null,null,null,"Total",{"$f":"SUM(J44:J47)","v":20125},"Margin",1,"Total with Margin",{"$f":"G48+G48*I48","v":40250}]
[null,null,null,null,null,"Percent of available processing",{"$f":"(G48/$G$64)","v":0.15400803520183662},"Clock Cycles",2]
[null,null,null,null,null,"Utilities"]
[null,null,null,null,null,"Basic Math",1,1,0.5,{"$f":"IF(AND(H51=1),G51*(Constants!N163+(Constants!N163*I51)+(Constants!N163*0.25)),G51*Constants!N163+Constants!N163*I51)","v":1400}]
[null,null,null,null,null,"Transcendental Math",1,1,0.5,{"$f":"IF(AND(H52=1),G52*(Constants!N164+(Constants!N164*I52)+(Constants!N164*0.25)),G52*Constants!N164+Constants!N164*I52)","v":2625}]
[null,null,null,null,null,"Matrix Math",1,1,0.5,{"$f":"IF(AND(H53=1),G53*(Constants!N165+(Constants!N165*I53)+(Constants!N165*0.25)),G53*Constants!N165+Constants!N165*I53)","v":3150}]
[null,null,null,null,null,"Time Mng and conversion",1,1,0.5,{"$f":"IF(AND(H54=1),G54*(Constants!N166+(Constants!N166*I54)+(Constants!N166*0.25)),G54*Constants!N166+Constants!N166*I54)","v":2100}]
[null,null,null,null,null,"Coordinate conversion",1,1,0.5,{"$f":"IF(AND(H55=1),G55*(Constants!N167+(Constants!N167*I55)+(Constants!N167*0.25)),G55*Constants!N167+Constants!N167*I55)","v":3500}]
[null,null,null,null,null,"Total",{"$f":"SUM(J51:J55)","v":12775},"Margin",1,"Total with Margin",{"$f":"G56+G56*I56","v":25550}]
[null,null,null,null,null,"Percent of available processing",{"$f":"(G56/$G$64)","v":9.776162234551368E-2},"Clock Cycle",2]
[null,null,null,null,null,"Others"]
[null,null,null,null,null,"Momentum Mng",1,1,0.5,{"$f":"IF(H59=1,Constants!N172+(Constants!N172*0.25)+Constants!N172*I59,G59*Constants!N172+Constants!N172*I59)","v":5250}]
[null,null,null,null,null,"Power Mng",1,1,0.5,{"$f":"IF(H60=1,Constants!N173+(Constants!N173*0.25)+Constants!N173*I60,G60*Constants!N173+Constants!N173*I60)","v":2100},1]
[null,null,null,null,null,"Thermal Control",1,1,0.5,{"$f":"IF(H61=1,Constants!N174+(Constants!N174*0.25)+Constants!N174*I61,G61*Constants!N174+Constants!N174*I61)","v":1400},0.1]
[null,null,null,null,null,"Total",{"$f":"SUM(J58:J61)","v":8750},"Margin",1,"Total with Margin",{"$f":"G62+G62*I62","v":17500}]
[null,null,null,null,null,"Percent of available processing",{"$f":"(G62/$G$64)","v":6.696001530514635E-2},"Clock Cycle",2]
[null,null,null,null,null,"Grand Total",{"$f":"SUM(G62,G56,G48,G42,G35,G24,G13)","v":130675},"Margin",0.2,"Total With Margin",{"$f":"G64+G64*I64","v":156810}]
[]
[]
[]
[]
[]
[]
[]
[]
[]
[]
[]
[]
[]
[]
[]
[]
[]
[]
[]
["Centralized Single Processor (Single Master)","RS422",null,null,1]
["Bus Architecture Federated ( Single Master)","RS485",null,null,0]
[null,"PASTE"]
[null,"CAN"]
[null,"MIL-STD-1553"]
[null,"I2C"]
[]
[]
[]
[]
[]
[]
[]
[]
[null,null,"Compression Rate"]
["GNU","None",1]
["LINUX","Lossless Compression",{"$f":"1/4","v":0.25}]
["BSD ","Near-lossless compression",{"$f":"1/30","v":3.3333333333333333E-2}]
["OAR (real-time multiprocessor)","Lossy Compression",{"$f":"1/80","v":1.2500000000000001E-2}]
[]
[]
["Bus I/O","Data Rate"]
["MIL-STD-1553",1000000,"bit/s"]
["I2C",400000,"bit/s"]
["SpireWire",400000000]
["CAN",5000000]
["Time Triggered ( Ethernet)",10000000000]
[]
[]
[]
[]
[]
[]
[]
["MIL-STD-1553",1000000,"bit/s"]
["I2C",400000,"bit/s"]
["SpireWire",400000000]
["CAN",5000000]
["Time Triggered ( Ethernet)",10000000000]

{"sheet":"Distributed - ADCS board","index":5,"n_rows":122,"n_cols":11,"rows_kept":122,"cut":false,"hidden":true,"merged":[[6,0,6,3],[6,5,6,10],[14,0,14,3]]}
[]
[]
[]
[]
[]
[]
["ADCS Processor",null,null,null,null,"CSC(Computer software components)"]
["Software line of codes",null,{"$f":"K64","v":120510},"SLOC",null,"Function","Is the function required?","Advanced Programming language (from assembly) ","Complexity vs SOA","SLOC","Typical Execution Frequency [Hz]"]
["CPU frequency",5,{"$f":"IF(B9=\"\",\"\",B9)","v":5},"MHz",null,"Communication"]
["OBC throughput ",null,{"$f":"IF(B10=\"\",ROUND((C9/(G14*I14+G25*I25+G36*I36+G43*I43+G57*I57+G63*I63+G49*I49)),0),\"\")","v":2},"MIPS",null,"Command Processing",0,1,1,{"$f":"IF(AND(H10=1),G10*(Constants!N116+(Constants!N116*I10)+(Constants!N116*0.25)),G10*Constants!N116+Constants!N116*I10)","v":0},10]
["Data protocol",null,"MIL-STD-1553",null,null,"Telemetry processing",1,1,1,{"$f":"IF(AND(H11=1),G11*(Constants!N117+(Constants!N117*I11)+(Constants!N117*0.25)),G11*Constants!N117+Constants!N117*I11)","v":2250},10]
["I/O ",null,"MIL-STD-1553",{"$f":"IF(VLOOKUP(C12,A118:B122,2,FALSE)<'CDH - DataBudget & Mass Storage'!C15,\"Not Comply\",\"Comply\")","v":"Comply"},null,"Telemetry processing (with compression)",0,1,1,{"$f":"IF(AND(H12=1),G12*(Constants!N118+(Constants!N118*I12)+(Constants!N118*0.25)),G12*Constants!N118+Constants!N118*I12)","v":0}]
[null,null,null,null,null,"Total",{"$f":"SUM(J10:J12)","v":2250},"Margin",1,"Total with Margin",{"$f":"G13+G13*I13","v":4500}]
[null,null,null,null,null,"Percent of available processing",{"$f":"(G13/$G$64)","v":2.2404779686333084E-2},"Clock Cycles",10]
["Output to OCDT",null,null,null,null,"Sensor"]
["ADCS board frequency ",null,{"$f":"IF(B16=\"\",C9,B16)","v":5},"Hz",null,"Rate Gyro",1,1,0.5,{"$f":"IF(AND(H16=1),G16*(Constants!N124+(Constants!N124*I16)+(Constants!N124*0.25)),G16* Constants!N124+Constants!N124*I16)","v":1400},10]
["ADCS board throughput ",null,{"$f":"IF(B17=\"\",C10,B17)","v":2},null,null,"Sun Sensor",1,1,0.5,{"$f":"IF(AND(H17=1),G17*(Constants!N125+(Constants!N125*I17)+(Constants!N125*0.25)),G17* Constants!N125+Constants!N125*I17)","v":875},1]
["ADCS Board mass [estimated] ",null,{"$f":"B18","v":0},"Kg",null,"Earth Sensor",1,1,0.5,{"$f":"IF(AND(H18=1),G18*(Constants!N126+(Constants!N126*I18)+(Constants!N126*0.25)),G18* Constants!N126+Constants!N126*I18)","v":2100},2]
["ADCS Board power [estimated]",null,{"$f":"B19","v":0},"W",null,"Magnetometer",1,1,0.5,{"$f":"IF(AND(H19=1),G19*(Constants!N127+(Constants!N127*I19)+(Constants!N127*0.25)),G19* Constants!N127+Constants!N127*I19)","v":350},0.01]
[null,null,null,null,null,"Star Tracker (no id)",1,1,0.5,{"$f":"IF(AND(H20=1),G20*(Constants!N128+(Constants!N128*I20)+(Constants!N128*0.25)),G20* Constants!N128+Constants!N128*I20)","v":700},0.01]
[null,null,null,null,null,"Star tracker output quaternion",1,1,0.5,{"$f":"IF(AND(H21=1),G21*(Constants!N129+(Constants!N129*I21)+(Constants!N129*0.25)),G21* Constants!N129+Constants!N129*I21)","v":3500},1]
[null,null,null,null,null,"GPS(Position/velocity)",1,1,0.5,{"$f":"IF(AND(H22=1),G22*(Constants!N130+(Constants!N130*I22)+(Constants!N130*0.25)),G22* Constants!N130+Constants!N130*I22)","v":525},1]
[null,null,null,null,null,"GPS(Pseudo Range)",1,1,0.5,{"$f":"IF(AND(H23=1),G23*(Constants!N131+(Constants!N131*I23)+(Constants!N131*0.25)),G23* Constants!N131+Constants!N131*I23)","v":4375}]
[null,null,null,null,null,"Total",{"$f":"SUM(J16:J23)","v":13825},"Margin",1,"Total with Margin",{"$f":"G24+G24*I24","v":27650}]
[null,null,null,null,null,"Percent of available processing",{"$f":"(G24/$G$64)","v":0.13766492407269107},"Clock Cycles",2]
[null,null,null,null,null,"AOCS"]
[null,null,null,null,null,"Kinetic integration",1,1,0.5,{"$f":"IF(AND(H27=1),G27*(Constants!N136+(Constants!N136*I27)+(Constants!N136*0.25)),G27*Constants!N136+Constants!N136*I27)","v":3500},10]
[null,null,null,null,null,"Kalman Filter",1,1,0.5,{"$f":"IF(AND(H28=1),G28*(Constants!N137+(Constants!N137*I28)+(Constants!N137*0.25)),G28*Constants!N137+Constants!N137*I28)","v":14000},0.01]
[null,null,null,null,null,"Error Determination",1,1,0.5,{"$f":"IF(AND(H29=1),G29*(Constants!N138+(Constants!N138*I29)+(Constants!N138*0.25)),G29*Constants!N138+Constants!N138*I29)","v":1400},10]
[null,null,null,null,null,"Process Control",1,1,0.5,{"$f":"IF(AND(H30=1),G30*(Constants!N139+(Constants!N139*I30)+(Constants!N139*0.25)),G30*Constants!N139+Constants!N139*I30)","v":6125},2]
[null,null,null,null,null,"Ephemerisis Propagator",1,1,0.5,{"$f":"IF(AND(H31=1),G31*(Constants!N140+(Constants!N140*I31)+(Constants!N140*0.25)),G31*Constants!N140+Constants!N140*I31)","v":3500},2]
[null,null,null,null,null,"Complex Ephemerisis",1,1,0.5,{"$f":"IF(AND(H32=1),G32*(Constants!N141+(Constants!N141*I32)+(Constants!N141*0.25)),G32*Constants!N141+Constants!N141*I32)","v":7000},2]
[null,null,null,null,null,"Orbit Propagator (Linear)",1,1,0.5,{"$f":"IF(AND(H33=1),G33*(Constants!N142+(Constants!N142*I33)+(Constants!N142*0.25)),G33*Constants!N142+Constants!N142*I33)","v":5250},1]
[null,null,null,null,null,"Orbit Propagator (Complex Environment)",1,1,0.5,{"$f":"IF(AND(H34=1),G34*(Constants!N143+(Constants!N143*I34)+(Constants!N143*0.25)),G34*Constants!N143+Constants!N143*I34)","v":14875},2]
[null,null,null,null,null,"Total",{"$f":"SUM(J27:J34)","v":55650},"Margin",1,"Total with Margin",{"$f":"G35+G35*I35","v":111300}]
[null,null,null,null,null,"Percent of available processing",{"$f":"(G35/$G$64)","v":0.55414488424197161},"Clock Cycles",2]
[null,null,null,null,null,"Actuator"]
[null,null,null,null,null,"Magnetic control",1,1,0.5,{"$f":"IF(AND(H38=1),G38*(Constants!N148+(Constants!N148*I38)+(Constants!N148*0.25)),G38*Constants!N148+Constants!N148*I38)","v":1050},2]
[null,null,null,null,null,"Thruster Control",1,1,0.5,{"$f":"IF(AND(H39=1),G39*(Constants!N149+(Constants!N149*I39)+(Constants!N149*0.25)),G39*Constants!N149+Constants!N149*I39)","v":1400},2]
[null,null,null,null,null,"Reaction wheel control",1,1,0.5,{"$f":"IF(AND(H40=1),G40*(Constants!N150+(Constants!N150*I40)+(Constants!N150*0.25)),G40*Constants!N150+Constants!N150*I40)","v":2100},2]
[null,null,null,null,null,"CMG control",1,1,0.5,{"$f":"IF(AND(H41=1),G41*(Constants!N151+(Constants!N151*I41)+(Constants!N151*0.25)),G41*Constants!N151+Constants!N151*I41)","v":2625},10]
[null,null,null,null,null,"Total",{"$f":"SUM(J38:J41)","v":7175},"Margin",1,"Total with Margin",{"$f":"G42+G42*I42","v":14350}]
[null,null,null,null,null,"Percent of available processing",{"$f":"(G42/$G$64)","v":7.1446352999751064E-2},"Clock Cycles",2]
[null,null,null,null,null,"FDIR"]
[null,null,null,null,null,"Monitor",0,1,0.5,{"$f":"IF(AND(H45=1),G45*(Constants!N156+(Constants!N156*I45)+(Constants!N156*0.25)),G45*Constants!N156+Constants!N156*I45)","v":0},5]
[null,null,null,null,null,"Fault identification",0,1,0.5,{"$f":"IF(AND(H46=1),G46*(Constants!N157+(Constants!N157*I46)+(Constants!N157*0.25)),G46*Constants!N157+Constants!N157*I46)","v":0},5]
[null,null,null,null,null,"Fault Correction",0,1,0.5,{"$f":"IF(AND(H47=1),G47*(Constants!N158+(Constants!N158*I47)+(Constants!N158*0.25)),G47*Constants!N158+Constants!N158*I47)","v":0},5]
[null,null,null,null,null,"Total",{"$f":"SUM(J44:J47)","v":0},"Margin",1,"Total with Margin",{"$f":"G48+G48*I48","v":0}]
[null,null,null,null,null,"Percent of available processing",{"$f":"(G48/$G$64)","v":0},"Clock Cycles",2]
[null,null,null,null,null,"Utilities"]
[null,null,null,null,null,"Basic Math",1,1,0.5,{"$f":"IF(AND(H51=1),G51*(Constants!N163+(Constants!N163*I51)+(Constants!N163*0.25)),G51*Constants!N163+Constants!N163*I51)","v":1400}]
[null,null,null,null,null,"Transcendental Math",1,1,0.5,{"$f":"IF(AND(H52=1),G52*(Constants!N164+(Constants!N164*I52)+(Constants!N164*0.25)),G52*Constants!N164+Constants!N164*I52)","v":2625}]
[null,null,null,null,null,"Matrix Math",1,1,0.5,{"$f":"IF(AND(H53=1),G53*(Constants!N165+(Constants!N165*I53)+(Constants!N165*0.25)),G53*Constants!N165+Constants!N165*I53)","v":3150}]
[null,null,null,null,null,"Time Mng and conversion",1,1,0.5,{"$f":"IF(AND(H54=1),G54*(Constants!N166+(Constants!N166*I54)+(Constants!N166*0.25)),G54*Constants!N166+Constants!N166*I54)","v":2100}]
[null,null,null,null,null,"Coordinate conversion",1,1,0.5,{"$f":"IF(AND(H55=1),G55*(Constants!N167+(Constants!N167*I55)+(Constants!N167*0.25)),G55*Constants!N167+Constants!N167*I55)","v":3500}]
[null,null,null,null,null,"Total",{"$f":"SUM(J51:J55)","v":12775},"Margin",1,"Total with Margin",{"$f":"G56+G56*I56","v":25550}]
[null,null,null,null,null,"Percent of available processing",{"$f":"(G56/$G$64)","v":0.12720936021906895},"Clock Cycle",2]
[null,null,null,null,null,"Others"]
[null,null,null,null,null,"Momentum Mng",1,1,0.5,{"$f":"IF(H59=1,Constants!N172+(Constants!N172*0.25)+Constants!N172*I59,G59*Constants!N172+Constants!N172*I59)","v":5250}]
[null,null,null,null,null,"Power Mng",0,1,0.5,{"$f":"IF(H60=1,Constants!N173+(Constants!N173*0.25)+Constants!N173*I60,G60*Constants!N173+Constants!N173*I60)","v":2100},1]
[null,null,null,null,null,"Thermal Control",0,1,0.5,{"$f":"IF(H61=1,Constants!N174+(Constants!N174*0.25)+Constants!N174*I61,G61*Constants!N174+Constants!N174*I61)","v":1400},0.1]
[null,null,null,null,null,"Total",{"$f":"SUM(J58:J61)","v":8750},"Margin",1,"Total with Margin",{"$f":"G62+G62*I62","v":17500}]
[null,null,null,null,null,"Percent of available processing",{"$f":"(G62/$G$64)","v":8.7129698780184214E-2},"Clock Cycle",2]
[null,null,null,null,null,"Grand Total",{"$f":"SUM(G62,G56,G48,G42,G35,G24,G13)","v":100425},"Margin",0.2,"Total With Margin",{"$f":"G64+G64*I64","v":120510}]
[]
[]
[]
[]
[]
[]
[]
[]
[]
[]
[]
[]
[]
[]
[]
[]
[]
[]
[]
["Centralized Single Processor (Single Master)","RS422",null,null,1]
["Bus Architecture Federated ( Single Master)","RS485",null,null,0]
[null,"PASTE"]
[null,"CAN"]
[null,"MIL-STD-1553"]
[null,"I2C"]
[]
[]
[]
[]
[]
[]
[]
[]
[null,null,"Compression Rate"]
["GNU","None",1]
["LINUX","Lossless Compression",{"$f":"1/4","v":0.25}]
["BSD ","Near-lossless compression",{"$f":"1/30","v":3.3333333333333333E-2}]
["OAR (real-time multiprocessor)","Lossy Compression",{"$f":"1/80","v":1.2500000000000001E-2}]
[]
[]
["Bus I/O","Data Rate"]
["MIL-STD-1553",1000000,"bit/s"]
["I2C",400000,"bit/s"]
["SpireWire",400000000]
["CAN",5000000]
["Time Triggered ( Ethernet)",10000000000]
[]
[]
[]
[]
[]
[]
[]
["MIL-STD-1553",1000000,"bit/s"]
["I2C",400000,"bit/s"]
["SpireWire",400000000]
["CAN",5000000]
["Time Triggered ( Ethernet)",10000000000]

{"sheet":"Distributed - Payload Board","index":6,"n_rows":122,"n_cols":11,"rows_kept":122,"cut":false,"hidden":true,"merged":[[6,0,6,3],[6,5,6,10],[15,0,15,3]]}
[]
[]
[]
[]
[]
[]
["Payload  Processor",null,null,null,null,"CSC(Computer software components)"]
["Payload Data Rate",null,{"$f":"'CDH - DataBudget & Mass Storage'!C7*0.125","v":7500},"Byte/sec",null,"Function","Is the function required?","Advanced Programming language (from assembly) ","Complexity vs SOA","SLOC","Typical Execution Frequency [Hz]"]
["Software line of codes",null,{"$f":"K64","v":82680},"SLOC",null,"Communication"]
["CPU frequency",400,{"$f":"IF(B10=\"\",\"\",B10)","v":400},"MHz",null,"Command Processing",1,1,1,{"$f":"IF(AND(H10=1),G10*(Constants!N116+(Constants!N116*I10)+(Constants!N116*0.25)),G10*Constants!N116+Constants!N116*I10)","v":2250},10]
["OBC throughput ",null,{"$f":"IF(B12=\"\",ROUND((C10/(G14*I14+G25*I25+G36*I36+G43*I43+G57*I57+G63*I63+G49*I49)),0),\"\")","v":159},"MIPS",null,"Telemetry processing",1,1,1,{"$f":"IF(AND(H11=1),G11*(Constants!N117+(Constants!N117*I11)+(Constants!N117*0.25)),G11*Constants!N117+Constants!N117*I11)","v":2250},10]
["Throughput (with Payload data)",null,{"$f":"IF(B12=\"\",ROUND((C10/(G14*I14+G25*I25+G36*I36+G43*I43+G57*I57+G63*I63+G49*I49))+('CDH -Distributed'!C8*'CDH -Distributed'!C9/100)*'CDH - DataBudget & Mass Storage'!F16,0),\"\")","v":189},"MIPS",null,"Telemetry processing (with compression)",0,1,1,{"$f":"IF(AND(H12=1),G12*(Constants!N118+(Constants!N118*I12)+(Constants!N118*0.25)),G12*Constants!N118+Constants!N118*I12)","v":0}]
["Data protocol",null,"MIL-STD-1553",null,null,"Total",{"$f":"SUM(J10:J12)","v":4500},"Margin",1,"Total with Margin",{"$f":"G13+G13*I13","v":9000}]
["I/O ",null,"MIL-STD-1553",{"$f":"IF(VLOOKUP(C14,A118:B122,2,FALSE)<'CDH - DataBudget & Mass Storage'!C7,\"Not Comply\",\"Comply\")","v":"Comply"},null,"Percent of available processing",{"$f":"(G13/$G$64)","v":6.5312046444121918E-2},"Clock Cycles",10]
[null,null,null,null,null,"Sensor"]
["Output to OCDT",null,null,null,null,"Rate Gyro",0,1,0.5,{"$f":"IF(AND(H16=1),G16*(Constants!N124+(Constants!N124*I16)+(Constants!N124*0.25)),G16* Constants!N124+Constants!N124*I16)","v":0},10]
["Payload board frequency ",null,{"$f":"IF(B17=\"\",C10,B17)","v":400},"Hz",null,"Sun Sensor",0,1,0.5,{"$f":"IF(AND(H17=1),G17*(Constants!N125+(Constants!N125*I17)+(Constants!N125*0.25)),G17* Constants!N125+Constants!N125*I17)","v":0},1]
["Payload board throughput ",null,{"$f":"IF(B18=\"\",C12,B18)","v":189},"MIPS",null,"Earth Sensor",0,1,0.5,{"$f":"IF(AND(H18=1),G18*(Constants!N126+(Constants!N126*I18)+(Constants!N126*0.25)),G18* Constants!N126+Constants!N126*I18)","v":0},2]
["Payload Board mass [estimated] ",null,{"$f":"B19","v":0},"Kg",null,"Magnetometer",0,1,0.5,{"$f":"IF(AND(H19=1),G19*(Constants!N127+(Constants!N127*I19)+(Constants!N127*0.25)),G19* Constants!N127+Constants!N127*I19)","v":0},0.01]
["Payload Board power [estimated]",null,{"$f":"B20","v":0},"W",null,"Star Tracker (no id)",0,1,0.5,{"$f":"IF(AND(H20=1),G20*(Constants!N128+(Constants!N128*I20)+(Constants!N128*0.25)),G20* Constants!N128+Constants!N128*I20)","v":0},0.01]
[null,null,null,null,null,"Star tracker output quaternion",0,1,0.5,{"$f":"IF(AND(H21=1),G21*(Constants!N129+(Constants!N129*I21)+(Constants!N129*0.25)),G21* Constants!N129+Constants!N129*I21)","v":0},1]
[null,null,null,null,null,"GPS(Position/velocity)",0,1,0.5,{"$f":"IF(AND(H22=1),G22*(Constants!N130+(Constants!N130*I22)+(Constants!N130*0.25)),G22* Constants!N130+Constants!N130*I22)","v":0},1]
[null,null,null,null,null,"GPS(Pseudo Range)",0,1,0.5,{"$f":"IF(AND(H23=1),G23*(Constants!N131+(Constants!N131*I23)+(Constants!N131*0.25)),G23* Constants!N131+Constants!N131*I23)","v":0}]
[null,null,null,null,null,"Total",{"$f":"SUM(J16:J23)","v":0},"Margin",1,"Total with Margin",{"$f":"G24+G24*I24","v":0}]
[null,null,null,null,null,"Percent of available processing",{"$f":"(G24/$G$64)","v":0},"Clock Cycles",2]
[null,null,null,null,null,"AOCS"]
[null,null,null,null,null,"Kinetic integration",1,1,0.5,{"$f":"IF(AND(H27=1),G27*(Constants!N136+(Constants!N136*I27)+(Constants!N136*0.25)),G27*Constants!N136+Constants!N136*I27)","v":3500},10]
[null,null,null,null,null,"Kalman Filter",1,1,0.5,{"$f":"IF(AND(H28=1),G28*(Constants!N137+(Constants!N137*I28)+(Constants!N137*0.25)),G28*Constants!N137+Constants!N137*I28)","v":14000},0.01]
[null,null,null,null,null,"Error Determination",0,1,0.5,{"$f":"IF(AND(H29=1),G29*(Constants!N138+(Constants!N138*I29)+(Constants!N138*0.25)),G29*Constants!N138+Constants!N138*I29)","v":0},10]
[null,null,null,null,null,"Process Control",0,1,0.5,{"$f":"IF(AND(H30=1),G30*(Constants!N139+(Constants!N139*I30)+(Constants!N139*0.25)),G30*Constants!N139+Constants!N139*I30)","v":0},2]
[null,null,null,null,null,"Ephemerisis Propagator",0,1,0.5,{"$f":"IF(AND(H31=1),G31*(Constants!N140+(Constants!N140*I31)+(Constants!N140*0.25)),G31*Constants!N140+Constants!N140*I31)","v":0},2]
[null,null,null,null,null,"Complex Ephemerisis",0,1,0.5,{"$f":"IF(AND(H32=1),G32*(Constants!N141+(Constants!N141*I32)+(Constants!N141*0.25)),G32*Constants!N141+Constants!N141*I32)","v":0},2]
[null,null,null,null,null,"Orbit Propagator (Linear)",1,1,0.5,{"$f":"IF(AND(H33=1),G33*(Constants!N142+(Constants!N142*I33)+(Constants!N142*0.25)),G33*Constants!N142+Constants!N142*I33)","v":5250},1]
[null,null,null,null,null,"Orbit Propagator (Complex Environment)",0,1,0.5,{"$f":"IF(AND(H34=1),G34*(Constants!N143+(Constants!N143*I34)+(Constants!N143*0.25)),G34*Constants!N143+Constants!N143*I34)","v":0},2]
[null,null,null,null,null,"Total",{"$f":"SUM(J27:J34)","v":22750},"Margin",1,"Total with Margin",{"$f":"G35+G35*I35","v":45500}]
[null,null,null,null,null,"Percent of available processing",{"$f":"(G35/$G$64)","v":0.330188679245283},"Clock Cycles",2]
[null,null,null,null,null,"Actuator"]
[null,null,null,null,null,"Magnetic control",0,1,0.5,{"$f":"IF(AND(H38=1),G38*(Constants!N148+(Constants!N148*I38)+(Constants!N148*0.25)),G38*Constants!N148+Constants!N148*I38)","v":0},2]
[null,null,null,null,null,"Thruster Control",0,1,0.5,{"$f":"IF(AND(H39=1),G39*(Constants!N149+(Constants!N149*I39)+(Constants!N149*0.25)),G39*Constants!N149+Constants!N149*I39)","v":0},2]
[null,null,null,null,null,"Reaction wheel control",0,1,0.5,{"$f":"IF(AND(H40=1),G40*(Constants!N150+(Constants!N150*I40)+(Constants!N150*0.25)),G40*Constants!N150+Constants!N150*I40)","v":0},2]
[null,null,null,null,null,"CMG control",0,1,0.5,{"$f":"IF(AND(H41=1),G41*(Constants!N151+(Constants!N151*I41)+(Constants!N151*0.25)),G41*Constants!N151+Constants!N151*I41)","v":0},10]
[null,null,null,null,null,"Total",{"$f":"SUM(J38:J41)","v":0},"Margin",1,"Total with Margin",{"$f":"G42+G42*I42","v":0}]
[null,null,null,null,null,"Percent of available processing",{"$f":"(G42/$G$64)","v":0},"Clock Cycles",2]
[null,null,null,null,null,"FDIR"]
[null,null,null,null,null,"Monitor",1,1,0.5,{"$f":"IF(AND(H45=1),G45*(Constants!N156+(Constants!N156*I45)+(Constants!N156*0.25)),G45*Constants!N156+Constants!N156*I45)","v":7000},5]
[null,null,null,null,null,"Fault identification",1,1,0.5,{"$f":"IF(AND(H46=1),G46*(Constants!N157+(Constants!N157*I46)+(Constants!N157*0.25)),G46*Constants!N157+Constants!N157*I46)","v":4375},5]
[null,null,null,null,null,"Fault Correction",1,1,0.5,{"$f":"IF(AND(H47=1),G47*(Constants!N158+(Constants!N158*I47)+(Constants!N158*0.25)),G47*Constants!N158+Constants!N158*I47)","v":8750},5]
[null,null,null,null,null,"Total",{"$f":"SUM(J44:J47)","v":20125},"Margin",1,"Total with Margin",{"$f":"G48+G48*I48","v":40250}]
[null,null,null,null,null,"Percent of available processing",{"$f":"(G48/$G$64)","v":0.2920899854862119},"Clock Cycles",2]
[null,null,null,null,null,"Utilities"]
[null,null,null,null,null,"Basic Math",1,1,0.5,{"$f":"IF(AND(H51=1),G51*(Constants!N163+(Constants!N163*I51)+(Constants!N163*0.25)),G51*Constants!N163+Constants!N163*I51)","v":1400}]
[null,null,null,null,null,"Transcendental Math",1,1,0.5,{"$f":"IF(AND(H52=1),G52*(Constants!N164+(Constants!N164*I52)+(Constants!N164*0.25)),G52*Constants!N164+Constants!N164*I52)","v":2625}]
[null,null,null,null,null,"Matrix Math",1,1,0.5,{"$f":"IF(AND(H53=1),G53*(Constants!N165+(Constants!N165*I53)+(Constants!N165*0.25)),G53*Constants!N165+Constants!N165*I53)","v":3150}]
[null,null,null,null,null,"Time Mng and conversion",1,1,0.5,{"$f":"IF(AND(H54=1),G54*(Constants!N166+(Constants!N166*I54)+(Constants!N166*0.25)),G54*Constants!N166+Constants!N166*I54)","v":2100}]
[null,null,null,null,null,"Coordinate conversion",1,1,0.5,{"$f":"IF(AND(H55=1),G55*(Constants!N167+(Constants!N167*I55)+(Constants!N167*0.25)),G55*Constants!N167+Constants!N167*I55)","v":3500}]
[null,null,null,null,null,"Total",{"$f":"SUM(J51:J55)","v":12775},"Margin",1,"Total with Margin",{"$f":"G56+G56*I56","v":25550}]
[null,null,null,null,null,"Percent of available processing",{"$f":"(G56/$G$64)","v":0.18541364296081278},"Clock Cycle",2]
[null,null,null,null,null,"Others"]
[null,null,null,null,null,"Momentum Mng",1,1,0.5,{"$f":"IF(H59=1,Constants!N172+(Constants!N172*0.25)+Constants!N172*I59,G59*Constants!N172+Constants!N172*I59)","v":5250}]
[null,null,null,null,null,"Power Mng",1,1,0.5,{"$f":"IF(H60=1,Constants!N173+(Constants!N173*0.25)+Constants!N173*I60,G60*Constants!N173+Constants!N173*I60)","v":2100},1]
[null,null,null,null,null,"Thermal Control",1,1,0.5,{"$f":"IF(H61=1,Constants!N174+(Constants!N174*0.25)+Constants!N174*I61,G61*Constants!N174+Constants!N174*I61)","v":1400},0.1]
[null,null,null,null,null,"Total",{"$f":"SUM(J58:J61)","v":8750},"Margin",1,"Total with Margin",{"$f":"G62+G62*I62","v":17500}]
[null,null,null,null,null,"Percent of available processing",{"$f":"(G62/$G$64)","v":0.1269956458635704},"Clock Cycle",2]
[null,null,null,null,null,"Grand Total",{"$f":"SUM(G62,G56,G48,G42,G35,G24,G13)","v":68900},"Margin",0.2,"Total With Margin",{"$f":"G64+G64*I64","v":82680}]
[]
[]
[]
[]
[]
[]
[]
[]
[]
[]
[]
[]
[]
[]
[]
[]
[]
[]
[]
["Centralized Single Processor (Single Master)","RS422",null,null,1]
["Bus Architecture Federated ( Single Master)","RS485",null,null,0]
[null,"PASTE"]
[null,"CAN"]
[null,"MIL-STD-1553"]
[null,"I2C"]
[]
[]
[]
[]
[]
[]
[]
[]
[null,null,"Compression Rate"]
["GNU","None",1]
["LINUX","Lossless Compression",{"$f":"1/4","v":0.25}]
["BSD ","Near-lossless compression",{"$f":"1/30","v":3.3333333333333333E-2}]
["OAR (real-time multiprocessor)","Lossy Compression",{"$f":"1/80","v":1.2500000000000001E-2}]
[]
[]
["Bus I/O","Data Rate"]
["MIL-STD-1553",1000000,"bit/s"]
["I2C",400000,"bit/s"]
["SpireWire",400000000]
["CAN",5000000]
["Time Triggered ( Ethernet)",10000000000]
[]
[]
[]
[]
[]
[]
[]
["MIL-STD-1553",1000000,"bit/s"]
["I2C",400000,"bit/s"]
["SpireWire",400000000]
["CAN",5000000]
["Time Triggered ( Ethernet)",10000000000]

{"sheet":"Distributed - TT&C","index":7,"n_rows":122,"n_cols":11,"rows_kept":122,"cut":false,"hidden":true,"merged":[[6,0,6,3],[6,5,6,10],[13,0,13,3]]}
[]
[]
[]
[]
[]
[]
["TT&C Processor",null,null,null,null,"CSC(Computer software components)"]
["Software line of codes",null,{"$f":"K64","v":64830},"SLOC",null,"Function","Is the function required?","Advanced Programming language (from assembly) ","Complexity vs SOA","SLOC","Typical Execution Frequency [Hz]"]
["CPU frequency",2,{"$f":"IF(B9=\"\",\"\",B9)","v":2},"MHz",null,"Communication"]
["Throughput ",null,{"$f":"IF(B10=\"\",ROUND((C9/(G14*I14+G25*I25+G36*I36+G43*I43+G57*I57+G63*I63+G49*I49)),0),\"\")","v":1},"MIPS",null,"Command Processing",1,1,1,{"$f":"IF(AND(H10=1),G10*(Constants!N116+(Constants!N116*I10)+(Constants!N116*0.25)),G10*Constants!N116+Constants!N116*I10)","v":2250},10]
["Data protocol",null,"MIL-STD-1553",null,null,"Telemetry processing",1,1,1,{"$f":"IF(AND(H11=1),G11*(Constants!N117+(Constants!N117*I11)+(Constants!N117*0.25)),G11*Constants!N117+Constants!N117*I11)","v":2250},10]
["I/O ",null,"MIL-STD-1553",{"$f":"IF(VLOOKUP(C12,A118:B122,2,FALSE)<'CDH - DataBudget & Mass Storage'!C14,\"Not Comply\",\"Comply\")","v":"Comply"},null,"Telemetry processing (with compression)",1,1,1,{"$f":"IF(AND(H12=1),G12*(Constants!N118+(Constants!N118*I12)+(Constants!N118*0.25)),G12*Constants!N118+Constants!N118*I12)","v":7875}]
[null,null,null,null,null,"Total",{"$f":"SUM(J10:J12)","v":12375},"Margin",1,"Total with Margin",{"$f":"G13+G13*I13","v":24750}]
["Output to OCDT",null,null,null,null,"Percent of available processing",{"$f":"(G13/$G$64)","v":0.22906062008329478},"Clock Cycles",10]
["TT&C board frequency ",null,{"$f":"IF(B15=\"\",C9,B15)","v":2},"Hz",null,"Sensor"]
["TT&C board throughput ",null,{"$f":"IF(B16=\"\",C10,B16)","v":1},"MIPS",null,"Rate Gyro",0,1,0.5,{"$f":"IF(AND(H16=1),G16*(Constants!N124+(Constants!N124*I16)+(Constants!N124*0.25)),G16* Constants!N124+Constants!N124*I16)","v":0},10]
["TT&C Board mass [estimated] ",null,{"$f":"B17","v":0},"Kg",null,"Sun Sensor",0,1,0.5,{"$f":"IF(AND(H17=1),G17*(Constants!N125+(Constants!N125*I17)+(Constants!N125*0.25)),G17* Constants!N125+Constants!N125*I17)","v":0},1]
["TT&C Board power [estimated]",null,{"$f":"B18","v":0},"W",null,"Earth Sensor",0,1,0.5,{"$f":"IF(AND(H18=1),G18*(Constants!N126+(Constants!N126*I18)+(Constants!N126*0.25)),G18* Constants!N126+Constants!N126*I18)","v":0},2]
[null,null,null,null,null,"Magnetometer",0,1,0.5,{"$f":"IF(AND(H19=1),G19*(Constants!N127+(Constants!N127*I19)+(Constants!N127*0.25)),G19* Constants!N127+Constants!N127*I19)","v":0},0.01]
[null,null,null,null,null,"Star Tracker (no id)",0,1,0.5,{"$f":"IF(AND(H20=1),G20*(Constants!N128+(Constants!N128*I20)+(Constants!N128*0.25)),G20* Constants!N128+Constants!N128*I20)","v":0},0.01]
[null,null,null,null,null,"Star tracker output quaternion",0,1,0.5,{"$f":"IF(AND(H21=1),G21*(Constants!N129+(Constants!N129*I21)+(Constants!N129*0.25)),G21* Constants!N129+Constants!N129*I21)","v":0},1]
[null,null,null,null,null,"GPS(Position/velocity)",0,1,0.5,{"$f":"IF(AND(H22=1),G22*(Constants!N130+(Constants!N130*I22)+(Constants!N130*0.25)),G22* Constants!N130+Constants!N130*I22)","v":0},1]
[null,null,null,null,null,"GPS(Pseudo Range)",0,1,0.5,{"$f":"IF(AND(H23=1),G23*(Constants!N131+(Constants!N131*I23)+(Constants!N131*0.25)),G23* Constants!N131+Constants!N131*I23)","v":0}]
[null,null,null,null,null,"Total",{"$f":"SUM(J16:J23)","v":0},"Margin",1,"Total with Margin",{"$f":"G24+G24*I24","v":0}]
[null,null,null,null,null,"Percent of available processing",{"$f":"(G24/$G$64)","v":0},"Clock Cycles",2]
[null,null,null,null,null,"AOCS"]
[null,null,null,null,null,"Kinetic integration",0,1,0.5,{"$f":"IF(AND(H27=1),G27*(Constants!N136+(Constants!N136*I27)+(Constants!N136*0.25)),G27*Constants!N136+Constants!N136*I27)","v":0},10]
[null,null,null,null,null,"Kalman Filter",0,1,0.5,{"$f":"IF(AND(H28=1),G28*(Constants!N137+(Constants!N137*I28)+(Constants!N137*0.25)),G28*Constants!N137+Constants!N137*I28)","v":0},0.01]
[null,null,null,null,null,"Error Determination",0,1,0.5,{"$f":"IF(AND(H29=1),G29*(Constants!N138+(Constants!N138*I29)+(Constants!N138*0.25)),G29*Constants!N138+Constants!N138*I29)","v":0},10]
[null,null,null,null,null,"Process Control",0,1,0.5,{"$f":"IF(AND(H30=1),G30*(Constants!N139+(Constants!N139*I30)+(Constants!N139*0.25)),G30*Constants!N139+Constants!N139*I30)","v":0},2]
[null,null,null,null,null,"Ephemerisis Propagator",0,1,0.5,{"$f":"IF(AND(H31=1),G31*(Constants!N140+(Constants!N140*I31)+(Constants!N140*0.25)),G31*Constants!N140+Constants!N140*I31)","v":0},2]
[null,null,null,null,null,"Complex Ephemerisis",0,1,0.5,{"$f":"IF(AND(H32=1),G32*(Constants!N141+(Constants!N141*I32)+(Constants!N141*0.25)),G32*Constants!N141+Constants!N141*I32)","v":0},2]
[null,null,null,null,null,"Orbit Propagator (Linear)",0,1,0.5,{"$f":"IF(AND(H33=1),G33*(Constants!N142+(Constants!N142*I33)+(Constants!N142*0.25)),G33*Constants!N142+Constants!N142*I33)","v":0},1]
[null,null,null,null,null,"Orbit Propagator (Complex Environment)",0,1,0.5,{"$f":"IF(AND(H34=1),G34*(Constants!N143+(Constants!N143*I34)+(Constants!N143*0.25)),G34*Constants!N143+Constants!N143*I34)","v":0},2]
[null,null,null,null,null,"Total",{"$f":"SUM(J27:J34)","v":0},"Margin",1,"Total with Margin",{"$f":"G35+G35*I35","v":0}]
[null,null,null,null,null,"Percent of available processing",{"$f":"(G35/$G$64)","v":0},"Clock Cycles",2]
[null,null,null,null,null,"Actuator"]
[null,null,null,null,null,"Magnetic control",0,1,0.5,{"$f":"IF(AND(H38=1),G38*(Constants!N148+(Constants!N148*I38)+(Constants!N148*0.25)),G38*Constants!N148+Constants!N148*I38)","v":0},2]
[null,null,null,null,null,"Thruster Control",0,1,0.5,{"$f":"IF(AND(H39=1),G39*(Constants!N149+(Constants!N149*I39)+(Constants!N149*0.25)),G39*Constants!N149+Constants!N149*I39)","v":0},2]
[null,null,null,null,null,"Reaction wheel control",0,1,0.5,{"$f":"IF(AND(H40=1),G40*(Constants!N150+(Constants!N150*I40)+(Constants!N150*0.25)),G40*Constants!N150+Constants!N150*I40)","v":0},2]
[null,null,null,null,null,"CMG control",0,1,0.5,{"$f":"IF(AND(H41=1),G41*(Constants!N151+(Constants!N151*I41)+(Constants!N151*0.25)),G41*Constants!N151+Constants!N151*I41)","v":0},10]
[null,null,null,null,null,"Total",{"$f":"SUM(J38:J41)","v":0},"Margin",1,"Total with Margin",{"$f":"G42+G42*I42","v":0}]
[null,null,null,null,null,"Percent of available processing",{"$f":"(G42/$G$64)","v":0},"Clock Cycles",2]
[null,null,null,null,null,"FDIR"]
[null,null,null,null,null,"Monitor",1,1,0.5,{"$f":"IF(AND(H45=1),G45*(Constants!N156+(Constants!N156*I45)+(Constants!N156*0.25)),G45*Constants!N156+Constants!N156*I45)","v":7000},5]
[null,null,null,null,null,"Fault identification",1,1,0.5,{"$f":"IF(AND(H46=1),G46*(Constants!N157+(Constants!N157*I46)+(Constants!N157*0.25)),G46*Constants!N157+Constants!N157*I46)","v":4375},5]
[null,null,null,null,null,"Fault Correction",1,1,0.5,{"$f":"IF(AND(H47=1),G47*(Constants!N158+(Constants!N158*I47)+(Constants!N158*0.25)),G47*Constants!N158+Constants!N158*I47)","v":8750},5]
[null,null,null,null,null,"Total",{"$f":"SUM(J44:J47)","v":20125},"Margin",1,"Total with Margin",{"$f":"G48+G48*I48","v":40250}]
[null,null,null,null,null,"Percent of available processing",{"$f":"(G48/$G$64)","v":0.37251272559000465},"Clock Cycles",2]
[null,null,null,null,null,"Utilities"]
[null,null,null,null,null,"Basic Math",1,1,0.5,{"$f":"IF(AND(H51=1),G51*(Constants!N163+(Constants!N163*I51)+(Constants!N163*0.25)),G51*Constants!N163+Constants!N163*I51)","v":1400}]
[null,null,null,null,null,"Transcendental Math",1,1,0.5,{"$f":"IF(AND(H52=1),G52*(Constants!N164+(Constants!N164*I52)+(Constants!N164*0.25)),G52*Constants!N164+Constants!N164*I52)","v":2625}]
[null,null,null,null,null,"Matrix Math",1,1,0.5,{"$f":"IF(AND(H53=1),G53*(Constants!N165+(Constants!N165*I53)+(Constants!N165*0.25)),G53*Constants!N165+Constants!N165*I53)","v":3150}]
[null,null,null,null,null,"Time Mng and conversion",1,1,0.5,{"$f":"IF(AND(H54=1),G54*(Constants!N166+(Constants!N166*I54)+(Constants!N166*0.25)),G54*Constants!N166+Constants!N166*I54)","v":2100}]
[null,null,null,null,null,"Coordinate conversion",1,1,0.5,{"$f":"IF(AND(H55=1),G55*(Constants!N167+(Constants!N167*I55)+(Constants!N167*0.25)),G55*Constants!N167+Constants!N167*I55)","v":3500}]
[null,null,null,null,null,"Total",{"$f":"SUM(J51:J55)","v":12775},"Margin",1,"Total with Margin",{"$f":"G56+G56*I56","v":25550}]
[null,null,null,null,null,"Percent of available processing",{"$f":"(G56/$G$64)","v":0.23646459972235076},"Clock Cycle",2]
[null,null,null,null,null,"Others"]
[null,null,null,null,null,"Momentum Mng",1,1,0.5,{"$f":"IF(H59=1,Constants!N172+(Constants!N172*0.25)+Constants!N172*I59,G59*Constants!N172+Constants!N172*I59)","v":5250}]
[null,null,null,null,null,"Power Mng",1,1,0.5,{"$f":"IF(H60=1,Constants!N173+(Constants!N173*0.25)+Constants!N173*I60,G60*Constants!N173+Constants!N173*I60)","v":2100},1]
[null,null,null,null,null,"Thermal Control",1,1,0.5,{"$f":"IF(H61=1,Constants!N174+(Constants!N174*0.25)+Constants!N174*I61,G61*Constants!N174+Constants!N174*I61)","v":1400},0.1]
[null,null,null,null,null,"Total",{"$f":"SUM(J58:J61)","v":8750},"Margin",1,"Total with Margin",{"$f":"G62+G62*I62","v":17500}]
[null,null,null,null,null,"Percent of available processing",{"$f":"(G62/$G$64)","v":0.16196205460434984},"Clock Cycle",2]
[null,null,null,null,null,"Grand Total",{"$f":"SUM(G62,G56,G48,G42,G35,G24,G13)","v":54025},"Margin",0.2,"Total With Margin",{"$f":"G64+G64*I64","v":64830}]
[]
[]
[]
[]
[]
[]
[]
[]
[]
[]
[]
[]
[]
[]
[]
[]
[]
[]
[]
["Centralized Single Processor (Single Master)","RS422",null,null,1]
["Bus Architecture Federated ( Single Master)","RS485",null,null,0]
[null,"PASTE"]
[null,"CAN"]
[null,"MIL-STD-1553"]
[null,"I2C"]
[]
[]
[]
[]
[]
[]
[]
[]
[null,null,"Compression Rate"]
["GNU","None",1]
["LINUX","Lossless Compression",{"$f":"1/4","v":0.25}]
["BSD ","Near-lossless compression",{"$f":"1/30","v":3.3333333333333333E-2}]
["OAR (real-time multiprocessor)","Lossy Compression",{"$f":"1/80","v":1.2500000000000001E-2}]
[]
[]
["Bus I/O","Data Rate"]
["MIL-STD-1553",1000000,"bit/s"]
["I2C",400000,"bit/s"]
["SpireWire",400000000]
["CAN",5000000]
["Time Triggered ( Ethernet)",10000000000]
[]
[]
[]
[]
[]
[]
[]
["MIL-STD-1553",1000000,"bit/s"]
["I2C",400000,"bit/s"]
["SpireWire",400000000]
["CAN",5000000]
["Time Triggered ( Ethernet)",10000000000]

{"sheet":"Radiation Hardness","index":8,"n_rows":31,"n_cols":23,"rows_kept":31,"cut":false,"hidden":false,"merged":[[7,14,8,16],[7,17,8,19],[7,20,8,22]]}
[]
[]
[]
[]
[]
[]
[]
[null,null,null,null,null,null,null,null,null,null,null,null,null,"Shielding","Total Dose (kRad) at 700 km",null,null,"Total Dose (kRad) at 1000 km ",null,null,"Total Dose (kRad) at 2000 km"]
[null,null,null,null,null,null,null,null,null,null,null,null,null,"Thickness"]
[null,null,null,null,null,null,null,null,null,null,null,null,null,"mil AL","1 yr","5 yrs","12 yrs","1 yr","3 yrs","5 yrs","1 yr","5 yrs","12 yrs"]
[null,null,null,null,null,null,null,null,null,null,null,null,null,50,7.16,{"$f":"5*O11","v":35.799999999999997},{"$f":"12*O11","v":85.92},14,{"$f":"3*R11","v":42},{"$f":"5*R11","v":70},164.68,{"$f":"5*U11","v":823.40000000000009},{"$f":"12*U11","v":1976.16}]
[null,null,null,null,null,null,null,null,null,null,null,null,null,{"$f":"10+N11","v":60},5.51,{"$f":"5*O12","v":27.549999999999997},{"$f":"12*O12","v":66.12},11,{"$f":"3*R12","v":33},{"$f":"5*R12","v":55},125.63,{"$f":"5*U12","v":628.15},{"$f":"12*U12","v":1507.56}]
[null,null,null,null,null,null,null,null,null,null,null,null,null,{"$f":"10+N12","v":70},4.33,21.65,51.96,8.8000000000000007,26.400000000000002,44,97.86,489.3,1174.32]
[null,null,null,null,null,null,null,null,null,null,null,null,null,80,3.58,17.899999999999999,42.96,7,21,35,80.19,400.95,962.28]
[null,null,null,null,null,null,null,null,null,null,null,null,null,90,2.96,14.8,35.519999999999996,5.8,17.399999999999999,29,65.709999999999994,328.54999999999995,788.52]
[null,null,null,null,null,null,null,null,null,null,null,null,null,100,2.4700000000000002,12.350000000000001,29.64,5,15,25,54.34,271.70000000000005,652.08000000000004]
[null,null,null,null,null,null,null,null,null,null,null,null,null,110,2.08,10.4,24.96,4.4000000000000004,13.200000000000001,22,45.55,227.75,546.59999999999991]
[null,null,null,null,null,null,null,null,null,null,null,null,null,120,1.83,9.15,21.96,3.9,11.7,19.5,39.89,199.45,478.68]
[null,null,null,null,null,null,null,null,null,null,null,null,null,130,1.58,7.9,18.96,3.5,10.5,17.5,34.29,171.45,411.48]
[null,null,null,null,null,null,null,null,null,null,null,null,null,140,1.38,6.8999999999999995,16.559999999999999,3.1,9.3000000000000007,15.5,29.81,149.04999999999998,357.71999999999997]
[null,null,null,null,null,null,null,null,null,null,null,null,null,150,1.2,6,14.399999999999999,2.8,8.3999999999999986,14,25.8,129,309.60000000000002]
[null,null,null,null,null,null,null,null,null,null,null,null,null,160,1.08,5.4,12.96,2.5,7.5,12.5,23.11,115.55,277.32]
[null,null,null,null,null,null,null,null,null,null,null,null,null,170,0.96,4.8,11.52,2.2000000000000002,6.6000000000000005,11,20.45,102.25,245.39999999999998]
[null,null,null,null,null,null,null,null,null,null,null,null,null,180,0.88,4.4000000000000004,10.56,2,6,10,18.66,93.3,223.92000000000002]
[null,null,null,null,null,null,null,null,null,null,null,null,null,190,0.79,3.95,9.48,1.84,5.5200000000000005,9.2000000000000011,16.670000000000002,83.350000000000009,200.04000000000002]
[null,null,null,null,null,null,null,null,null,null,null,null,null,200,0.73,3.65,8.76,1.7,5.0999999999999996,8.5,14.6,73,175.2]
[null,null,null,null,null,null,null,null,null,null,null,null,null,210,0.67,3.35,8.0400000000000009,1.6,4.8000000000000007,8,13.33,66.650000000000006,159.96]
[null,null,null,null,null,null,null,null,null,null,null,null,null,220,0.61,3.05,7.32,1.54,4.62,7.7,12.08,60.4,144.96]
[null,null,null,null,null,null,null,null,null,null,null,null,null,230,0.57999999999999996,2.9,6.9599999999999991,1.5,4.5,7.5,11.43,57.15,137.16]
[null,null,null,null,null,null,null,null,null,null,null,null,null,240,0.56999999999999995,2.8499999999999996,6.84,1.44,4.32,7.1999999999999993,11.17,55.85,134.04]
[null,null,null,null,null,null,null,null,null,null,null,null,null,250,0.55000000000000004,2.75,6.6000000000000005,1.4,4.1999999999999993,7,10.73,53.650000000000006,128.76]

{"sheet":"CDH -Distributed","index":9,"n_rows":112,"n_cols":16384,"rows_kept":112,"cut":false,"hidden":true,"merged":[[22,0,22,3],[6,5,6,10],[6,0,6,3],[14,0,14,3]]}
[]
[]
[]
[]
[]
[]
["Payload processing unit ",null,null,null,null,"CSC(Computer software componets)"]
["Payload Data Rate",null,{"$f":"'CDH - DataBudget & Mass Storage'!C7*0.125","v":7500},"Byte/sec",null,"Processes","Is the process required?","Programming Language different from assembly ","Complexity vs SOA","SLOC","Typical Exectution Frequency [Hz]"]
["Number of instructions per byte",null,{"$f":"IF(B9=\"\",1,\"\")","v":1},null,null,"Communication"]
["CPU frequency",400,{"$f":"IF(B10=\"\",\"\",B10)","v":400},"KHz",null,"Command Processing",1,1,1,{"$f":"IF(AND(H10=1),G10*(Constants!N116+(Constants!N116*I10)+(Constants!N116*0.25)),G10*Constants!N116+Constants!N116*I10)","v":2250},10]
["Estimated throughtput ",null,{"$f":"IF(B11=\"\",ROUND(((C10/(G14+G57*I57+G63*I63))+C8*C9)/'CDH - DataBudget & Mass Storage'!G11,0),\"\")","v":9386},"KIPS",null,"Telemetry processing",1,1,1,{"$f":"IF(AND(H11=1),G11*(Constants!N117+(Constants!N117*I11)+(Constants!N117*0.25)),G11*Constants!N117+Constants!N117*I11)","v":2250},10]
["Data protocol",null,"I2C",null,null,"Telemetry processing (with compression)",1,1,1,{"$f":"IF(AND(H12=1),G12*(Constants!N118+(Constants!N118*I12)+(Constants!N118*0.25)),G12*Constants!N118+Constants!N118*I12)","v":7875}]
["I/O bus",null,"RS485",{"$f":"IF(VLOOKUP(C13,A106:B112,2,FALSE)<'CDH - DataBudget & Mass Storage'!C7,\"Not Comply\",\"Comply\")","v":"Comply"},null,"Total",{"$f":"SUM(J10:J12)","v":12375},"Margin",1,"Total with Margin",{"$f":"G13+G13*I13","v":24750}]
[null,null,null,null,null,"Pecent of avaiable processing",{"$f":"(G13/$G$64)","v":4.7350296537210637E-2},"Clock Cycles",10]
["Telemetry and health keeping processing unit ",null,null,null,null,"Sensor"]
["Data rate",null,{"$f":"ROUND(('CDH - DataBudget & Mass Storage'!C14)*0.125,0)","v":98},"bit/sec",null,"Rate Gyro",1,1,0.5,{"$f":"IF(AND(H16=1),G16*(Constants!N124+(Constants!N124*I16)+(Constants!N124*0.25)),G16* Constants!N124+Constants!N124*I16)","v":1400},10]
["Estimated Lines of Code",null,{"$f":"K13+K56+K62","v":67800},"SLOC",null,"Sun Sensor",1,1,0.5,{"$f":"IF(AND(H17=1),G17*(Constants!N125+(Constants!N125*I17)+(Constants!N125*0.25)),G17* Constants!N125+Constants!N125*I17)","v":875},1]
["Minimum CPU frequency",10,{"$f":"IF(B18=\"\",\"\",B18)","v":10},"KHz"," ","Earth Sensor",1,1,0.5,{"$f":"IF(AND(H18=1),G18*(Constants!N126+(Constants!N126*I18)+(Constants!N126*0.25)),G18* Constants!N126+Constants!N126*I18)","v":2100},2]
["OBC throughtput ",null,{"$f":"IF(B19=\"\",ROUND((C18/(G14*I14+G49*I49+G57*I57+G63*I63))/'CDH - DataBudget & Mass Storage'!G13,2),B19)","v":12.62},"KIPS",null,"Magnetormeter",1,1,0.5,{"$f":"IF(AND(H19=1),G19*(Constants!N127+(Constants!N127*I19)+(Constants!N127*0.25)),G19* Constants!N127+Constants!N127*I19)","v":350},0.01]
["Data protocol",null,"I2C",null,null,"Star Tracker (no id)",1,1,0.5,{"$f":"IF(AND(H20=1),G20*(Constants!N128+(Constants!N128*I20)+(Constants!N128*0.25)),G20* Constants!N128+Constants!N128*I20)","v":700},0.01]
["I/O bus",null,"I2C",{"$f":"IF(VLOOKUP(C21,A106:B112,2,FALSE)<'CDH - DataBudget & Mass Storage'!C14,\"Not Comply\",\"Comply\")","v":"Comply"},null,"Star tracker output quaternion",1,1,0.5,{"$f":"IF(AND(H21=1),G21*(Constants!N129+(Constants!N129*I21)+(Constants!N129*0.25)),G21* Constants!N129+Constants!N129*I21)","v":3500},1]
[null,null,null,null,null,"GPS(Position/velocity)",1,1,0.5,{"$f":"IF(AND(H22=1),G22*(Constants!N130+(Constants!N130*I22)+(Constants!N130*0.25)),G22* Constants!N130+Constants!N130*I22)","v":525},1]
["ADCS processing unit",null,null,null,null,"GPS(Pseudo Range)",1,1,0.5,{"$f":"IF(AND(H23=1),G23*(Constants!N131+(Constants!N131*I23)+(Constants!N131*0.25)),G23* Constants!N131+Constants!N131*I23)","v":4375}]
["Data rate",null,{"$f":"ROUND('CDH - DataBudget & Mass Storage'!C15,2)","v":1200},"bit/sec",null,"Total",{"$f":"SUM(J16:J23)","v":13825},"Margin",1,"Total with Margin",{"$f":"G24+G24*I24","v":27650}]
["Estimated Lines of Code",null,{"$f":"K24+K35+K42+K48+K56","v":219100},"SLOC",null,"Pecent of avaiable processing",{"$f":"(G24/$G$64)","v":5.2898412091065619E-2},"Clock Cycles",2]
["Minimum CPU frequency",10,{"$f":"IF(B26=\"\",\"\",B26)","v":10},"KHz",null,"AOCS"]
["ADCS throughtput ",null,{"$f":"IF(B27=\"\",ROUND(C26/(G25*I25+G57*I57+G63*I63+G36*I36+G43*I43)/'CDH - DataBudget & Mass Storage'!G13,2),B27)","v":13.31},"KIPS",null,"Kintetik integration",1,1,0.5,{"$f":"IF(AND(H27=1),G27*(Constants!N136+(Constants!N136*I27)+(Constants!N136*0.25)),G27*Constants!N136+Constants!N136*I27)","v":3500},10]
["Data protocol",null,"I2C",null,null,"Kalman Filter",1,1,0.5,{"$f":"IF(AND(H28=1),G28*(Constants!N137+(Constants!N137*I28)+(Constants!N137*0.25)),G28*Constants!N137+Constants!N137*I28)","v":14000},0.01]
["I/O bus",null,"RS422",{"$f":"IF(VLOOKUP(C29,A106:B112,2,FALSE)<'CDH - DataBudget & Mass Storage'!C15,\"Not Comply\",\"Comply\")","v":"Comply"},null,"Error Determination",1,1,0.5,{"$f":"IF(AND(H29=1),G29*(Constants!N138+(Constants!N138*I29)+(Constants!N138*0.25)),G29*Constants!N138+Constants!N138*I29)","v":1400},10]
[null,null,null,null,null,"Process Control",1,1,0.5,{"$f":"IF(AND(H30=1),G30*(Constants!N139+(Constants!N139*I30)+(Constants!N139*0.25)),G30*Constants!N139+Constants!N139*I30)","v":6125},2]
[null,null,null,null,null,"Ephemerisis Propagator",1,1,0.5,{"$f":"IF(AND(H31=1),G31*(Constants!N140+(Constants!N140*I31)+(Constants!N140*0.25)),G31*Constants!N140+Constants!N140*I31)","v":3500},2]
[null,null,null,null,null,"Complex Ephemerisis",1,1,0.5,{"$f":"IF(AND(H32=1),G32*(Constants!N141+(Constants!N141*I32)+(Constants!N141*0.25)),G32*Constants!N141+Constants!N141*I32)","v":7000},2]
[null,null,null,null,null,"Orbit Propagator (Linear)",1,1,0.5,{"$f":"IF(AND(H33=1),G33*(Constants!N142+(Constants!N142*I33)+(Constants!N142*0.25)),G33*Constants!N142+Constants!N142*I33)","v":5250},1]
[null,null,null,null,null,"Orbit Propagator (Complex Envirolment)",1,1,0.5,{"$f":"IF(AND(H34=1),G34*(Constants!N143+(Constants!N143*I34)+(Constants!N143*0.25)),G34*Constants!N143+Constants!N143*I34)","v":14875},2]
[null,null,null,null,null,"Total",{"$f":"SUM(J27:J34)","v":55650},"Margin",1,"Total with Margin",{"$f":"G35+G35*I35","v":111300}]
[null,null,null,null,null,"Pecent of avaiable processing",{"$f":"(G35/$G$64)","v":0.21293284867036541},"Clock Cycles",2]
[null,null,null,null,null,"Actuator"]
[null,null,null,null,null,"Magnetic control",1,1,0.5,{"$f":"IF(AND(H38=1),G38*(Constants!N148+(Constants!N148*I38)+(Constants!N148*0.25)),G38*Constants!N148+Constants!N148*I38)","v":1050},2]
[null,null,null,null,null,"Thruster Control",1,1,0.5,{"$f":"IF(AND(H39=1),G39*(Constants!N149+(Constants!N149*I39)+(Constants!N149*0.25)),G39*Constants!N149+Constants!N149*I39)","v":1400},2]
[null,null,null,null,null,"Reaction wheel control",1,1,0.5,{"$f":"IF(AND(H40=1),G40*(Constants!N150+(Constants!N150*I40)+(Constants!N150*0.25)),G40*Constants!N150+Constants!N150*I40)","v":2100},2]
[null,null,null,null,null,"CMG control",1,1,0.5,{"$f":"IF(AND(H41=1),G41*(Constants!N151+(Constants!N151*I41)+(Constants!N151*0.25)),G41*Constants!N151+Constants!N151*I41)","v":2625},10]
[null,null,null,null,null,"Total",{"$f":"SUM(J38:J41)","v":7175},"Margin",1,"Total with Margin",{"$f":"G42+G42*I42","v":14350}]
[null,null,null,null,null,"Pecent of avaiable processing",{"$f":"(G42/$G$64)","v":2.7453606275110006E-2},"Clock Cycles",2]
[null,null,null,null,null,"FDIR"]
[null,null,null,null,null,"Monitor",1,1,0.5,{"$f":"IF(AND(H45=1),G45*(Constants!N156+(Constants!N156*I45)+(Constants!N156*0.25)),G45*Constants!N156+Constants!N156*I45)","v":7000},5]
[null,null,null,null,null,"Fault identification",1,1,0.5,{"$f":"IF(AND(H46=1),G46*(Constants!N157+(Constants!N157*I46)+(Constants!N157*0.25)),G46*Constants!N157+Constants!N157*I46)","v":4375},5]
[null,null,null,null,null,"Fault Correction",1,1,0.5,{"$f":"IF(AND(H47=1),G47*(Constants!N158+(Constants!N158*I47)+(Constants!N158*0.25)),G47*Constants!N158+Constants!N158*I47)","v":8750},5]
[null,null,null,null,null,"Total",{"$f":"SUM(J44:J47)","v":20125},"Margin",1,"Total with Margin",{"$f":"G48+G48*I48","v":40250}]
[null,null,null,null,null,"Pecent of avaiable processing",{"$f":"(G48/$G$64)","v":7.7004017600918309E-2},"Clock Cycles",2]
[null,null,null,null,null,"Utilites"]
[null,null,null,null,null,"Basic Math",1,1,0.5,{"$f":"IF(AND(H51=1),G51*(Constants!N163+(Constants!N163*I51)+(Constants!N163*0.25)),G51*Constants!N163+Constants!N163*I51)","v":1400}]
[null,null,null,null,null,"Trascendental Math",1,1,0.5,{"$f":"IF(AND(H52=1),G52*(Constants!N164+(Constants!N164*I52)+(Constants!N164*0.25)),G52*Constants!N164+Constants!N164*I52)","v":2625}]
[null,null,null,null,null,"Matrix Math",1,1,0.5,{"$f":"IF(AND(H53=1),G53*(Constants!N165+(Constants!N165*I53)+(Constants!N165*0.25)),G53*Constants!N165+Constants!N165*I53)","v":3150}]
[null,null,null,null,null,"Time Mng and conversion",1,1,0.5,{"$f":"IF(AND(H54=1),G54*(Constants!N166+(Constants!N166*I54)+(Constants!N166*0.25)),G54*Constants!N166+Constants!N166*I54)","v":2100}]
[null,null,null,null,null,"Coordinate conversion",1,1,0.5,{"$f":"IF(AND(H55=1),G55*(Constants!N167+(Constants!N167*I55)+(Constants!N167*0.25)),G55*Constants!N167+Constants!N167*I55)","v":3500}]
[null,null,null,null,null,"Total",{"$f":"SUM(J51:J55)","v":12775},"Margin",1,"Total with Margin",{"$f":"G56+G56*I56","v":25550}]
[null,null,null,null,null,"Pecent of avaiable processing",{"$f":"(G56/$G$64)","v":4.888081117275684E-2},"Clock Cycle",2]
[null,null,null,null,null,"Others"]
[null,null,null,null,null,"Momentum Mng",1,1,0.5,{"$f":"IF(H59=1,Constants!N172+(Constants!N172*0.25)+Constants!N172*I59,G59*Constants!N172+Constants!N172*I59)","v":5250}]
[null,null,null,null,null,"Power Mng",1,1,0.5,{"$f":"IF(H60=1,Constants!N173+(Constants!N173*0.25)+Constants!N173*I60,G60*Constants!N173+Constants!N173*I60)","v":2100},1]
[null,null,null,null,null,"Thermal Control",1,1,0.5,{"$f":"IF(H61=1,Constants!N174+(Constants!N174*0.25)+Constants!N174*I61,G61*Constants!N174+Constants!N174*I61)","v":1400},0.1]
[null,null,null,null,null,"Total",{"$f":"SUM(J58:J61)","v":8750},"Margin",1,"Total with Margin",{"$f":"G62+G62*I62","v":17500}]
[null,null,null,null,null,"Pecent of avaiable processing",{"$f":"(G62/$G$64)","v":3.3480007652573175E-2},"Clock Cycle",2]
[null,null,null,null,null,"Grand Total",{"$f":"SUM(K62,K56,K48,K42,K35,K24,K13)","v":261350},"Margin",0.2,"Total With Margin",{"$f":"G64+G64*I64","v":313620}]
[]
[]
[]
[]
[]
[]
[]
[]
[]
[]
[]
[]
[]
[]
[]
[]
[]
[]
[]
[null,"RS422",null,null,1]
[null,"RS485",null,null,0]
["Distributed - Bus ( Multi Master)","PASTE"]
["Distributed - Star","CAN"]
["Distributed Ring","Mil-STD-1553"]
[null,"I2C"]
[]
[]
[]
[]
[]
[]
[]
[]
[null,null,"Compression Rate"]
["GNU","None",1]
["LINUX","Lossless Compression",{"$f":"1/4","v":0.25}]
["BSD ","Near-lossless compression",{"$f":"1/30","v":3.3333333333333333E-2}]
["OAR (real-time multiprocessor)","Lossy Compression",{"$f":"1/80","v":1.2500000000000001E-2}]
[]
[]
["Bus I/O","Data Rate"]
["RS422",1000000,"RS422",1000000,null,null,"RS422",1000000,"RS422",1000000,"RS422",1000000,"RS422",1000000,"RS422",1000000,"RS422",1000000,"RS422",1000000,"RS422",1000000,"RS422",1000000,"RS422",1000000,"RS422",1000000,"RS422",1000000,"RS422",1000000,"RS422",1000000,"RS422",1000000,"RS422",1000000,"RS422",1000000,"RS422",1000000,"RS422",1000000,"RS422",1000000,"RS422",1000000,"RS422",1000000,"RS422",1000000,"RS422",1000000,"RS422",1000000,"RS422",1000000,"RS422",1000000,"RS422",1000000,"RS422",1000000,"RS422",1000000,"RS422",1000000,"RS422",1000000,"RS422",1000000,"RS422",1000000,"RS422",1000000,"RS422",1000000,"RS422",1000000,"RS422",1000000,"RS422",1000000,"RS422",1000000,"RS422",1000000,"RS422",1000000,"RS422",1000000,"RS422",1000000,"RS422",1000000,"RS422",1000000,"RS422",1000000,"RS422",1000000,"RS422",1000000,"RS422",1000000,"RS422",1000000,"RS422",1000000,"RS422",1000000,"RS422",1000000,"RS422",1000000,"RS422",1000000,"RS422",1000000,"RS422",1000000,"RS422",1000000,"RS422",1000000,"RS422",1000000,"RS422",1000000,"RS422",1000000,"RS422",1000000,"RS422",1000000,"RS422",1000000,"RS422",1000000,"RS422",1000000,"RS422",1000000,"RS422",1000000,"RS422",1000000,"RS422",1000000,"RS422",1000000,"RS422",1000000,"RS422",1000000,"RS422",1000000,"RS422",1000000,"RS422",1000000,"RS422",1000000,"RS422",1000000,"RS422",1000000,"RS422",1000000,"RS422",1000000,"RS422",1000000,"RS422",1000000,"RS422",1000000,"RS422",1000000,"RS422",1000000,"RS422",1000000,"RS422",1000000,"RS422",1000000,"RS422",1000000,"RS422",1000000,"RS422",1000000,"RS422",1000000,"RS422",1000000,"RS422",1000000,"RS422",1000000,"RS422",1000000,"RS422",1000000,"RS422",1000000,"RS422",1000000,"RS422",1000000,"RS422",1000000,"RS422",1000000,"RS422",1000000,"RS422",1000000,"RS422",1000000,"RS422",1000000,"RS422",1000000,"RS422",1000000,"RS422",1000000,"RS422",1000000,"RS422",1000000,"RS422",1000000,"RS422",1000000,"RS422",1000000,"RS422",1000000,"RS422",1000000,"RS422",1000000,"RS422",1000000,"RS422",1000000,"RS422",1000000,"RS422",1000000,"RS422",1000000,"RS422",1000000,"RS422",1000000,"RS422",1000000,"RS422",1000000,"RS422",1000000,"RS422",1000000,"RS422",1000000,"RS422",1000000,"RS422",1000000,"RS422",1000000,"RS422",1000000,"RS422",1000000,"RS422",1000000,"RS422",1000000,"RS422",1000000,"RS422",1000000,"RS422",1000000,"RS422",1000000,"RS422",1000000,"RS422",1000000,"RS422",1000000,"RS422",1000000,"RS422",1000000,"RS422",1000000,"RS422",1000000,"RS422",1000000,"RS422",1000000,"RS422",1000000,"RS422",1000000,"RS422",1000000,"RS422",1000000,"RS422",1000000,"RS422",1000000,"RS422",1000000,"RS422",1000000,"RS422",1000000,"RS422",1000000,"RS422",1000000,"RS422",1000000,"RS422",1000000,"RS422",1000000,"RS422",1000000,"RS422",1000000,"RS422",1000000,"RS422",1000000,"RS422",1000000,"RS422",1000000,"RS422",1000000,"RS422",1000000,"RS422",1000000,"RS422",1000000,"RS422",1000000,"RS422",1000000,"RS422",1000000,"RS422",1000000,"RS422",1000000,"RS422",1000000,"RS422",1000000,"RS422",1000000,"RS422",1000000,"RS422",1000000,"RS422",1000000,"RS422",1000000,"RS422",1000000,"RS422",1000000,"RS422",1000000,"RS422",1000000,"RS422",1000000,"RS422",1000000,"RS422",1000000,"RS422",1000000,"RS422",1000000,"RS422",1000000,"RS422",1000000,"RS422",1000000,"RS422",1000000,"RS422",1000000,"RS422",1000000,"RS422",1000000,"RS422",1000000,"RS422",1000000,"RS422",1000000,"RS422",1000000,"RS422",1000000,"RS422",1000000,"RS422",1000000,"RS422",1000000,"RS422",1000000,"RS422",1000000,"RS422",1000000,"RS422",1000000,"RS422",1000000,"RS422",1000000,"RS422",1000000,"RS422",1000000,"RS422",1000000,"RS422",1000000,"RS422",1000000,"RS422",1000000,"RS422",1000000,"RS422",1000000,"RS422",1000000,"RS422",1000000,"RS422",1000000,"RS422",1000000,"RS422",1000000,"RS422",1000000,"RS422",1000000,"RS422",1000000,"RS422",1000000,"RS422",1000000,"RS422",1000000,"RS422",1000000,"RS422",1000000,"RS422",1000000,"RS422",1000000,"RS422",1000000,"RS422",1000000,"RS422",1000000,"RS422",1000000,"RS422",1000000,"RS422",1000000,"RS422",1000000,"RS422",1000000,"RS422",1000000,"RS422",1000000,"RS422",1000000,"RS422",1000000,"RS422",1000000,"RS422",1000000,"RS422",1000000,"RS422",1000000,"RS422",1000000,"RS422",1000000,"RS422",1000000,"RS422",1000000,"RS422",1000000,"RS422",1000000,"RS422",1000000,"RS422",1000000,"RS422",1000000,"RS422",1000000,"RS422",1000000,"RS422",1000000,"RS422",1000000,"RS422",1000000,"RS422",1000000,"RS422",1000000,"RS422",1000000,"RS422",1000000,"RS422",1000000,"RS422",1000000,"RS422",1000000,"RS422",1000000,"RS422",1000000,"RS422",1000000,"RS422",1000000,"RS422",1000000,"RS422",1000000,"RS422",1000000,"RS422",1000000,"RS422",1000000,"RS422",1000000,"RS422",1000000,"RS422",1000000,"RS422",1000000,"RS422",1000000,"RS422",1000000,"RS422",1000000,"RS422",1000000,"RS422",1000000,"RS422",1000000,"RS422",1000000,"RS422",1000000,"RS422",1000000,"RS422",1000000,"RS422",1000000,"RS422",1000000,"RS422",1000000,"RS422",1000000,"RS422",1000000,"RS422",1000000,"RS422",1000000,"RS422",1000000,"RS422",1000000,"RS422",1000000,"RS422",1000000,"RS422",1000000,"RS422",1000000,"RS422",1000000,"RS422",1000000,"RS422",1000000,"RS422",1000000,"RS422",1000000,"RS422",1000000,"RS422",1000000,"RS422",1000000,"RS422",1000000,"RS422",1000000,"RS422",1000000,"RS422",1000000,"RS422",1000000,"RS422",1000000,"RS422",1000000,"RS422",1000000,"RS422",1000000,"RS422",1000000,"RS422",1000000,"RS422",1000000,"RS422",1000000,"RS422",1000000,"RS422",1000000,"RS422",1000000,"RS422",1000000,"RS422",1000000,"RS422",1000000,"RS422",1000000,"RS422",1000000,"RS422",1000000,"RS422",1000000,"RS422",1000000,"RS422",1000000,"RS422",1000000,"RS422",1000000,"RS422",1000000,"RS422",1000000,"RS422",1000000,"RS422",1000000,"RS422",1000000,"RS422",1000000,"RS422",1000000,"RS422",1000000,"RS422",1000000,"RS422",1000000,"RS422",1000000,"RS422",1000000,"RS422",1000000,"RS422",1000000,"RS422",1000000,"RS422",1000000,"RS422",1000000,"RS422",1000000,"RS422",1000000,"RS422",1000000,"RS422",1000000,"RS422",1000000,"RS422",1000000,"RS422",1000000,"RS422",1000000,"RS422",1000000,"RS422",1000000,"RS422",1000000,"RS422",1000000,"RS422",1000000,"RS422",1000000,"RS422",1000000,"RS422",1000000,"RS422",1000000,"RS422",1000000,"RS422",1000000,"RS422",1000000,"RS422",1000000,"RS422",1000000,"RS422",1000000,"RS422",1000000,"RS422",1000000,"RS422",1000000,"RS422",1000000,"RS422",1000000,"RS422",1000000,"RS422",1000000,"RS422",1000000,"RS422",1000000,"RS422",1000000,"RS422",1000000,"RS422",1000000,"RS422",1000000,"RS422",1000000,"RS422",1000000,"RS422",1000000,"RS422",1000000,"RS422",1000000,"RS422",1000000,"RS422",1000000,"RS422",1000000,"RS422",1000000,"RS422",1000000,"RS422",1000000,"RS422",1000000,"RS422",1000000,"RS422",1000000,"RS422",1000000,"RS422",1000000,"RS422",1000000,"RS422",1000000,"RS422",1000000,"RS422",1000000,"RS422",1000000,"RS422",1000000,"RS422",1000000,"RS422",1000000,"RS422",1000000,"RS422",1000000,"RS422",1000000,"RS422",1000000,"RS422",1000000,"RS422",1000000,"RS422",1000000,"RS422",1000000,"RS422",1000000,"RS422",1000000,"RS422",1000000,"RS422",1000000,"RS422",1000000,"RS422",1000000,"RS422",1000000,"RS422",1000000,"RS422",1000000,"RS422",1000000,"RS422",1000000,"RS422",1000000,"RS422",1000000,"RS422",1000000,"RS422",1000000,"RS422",1000000,"RS422",1000000,"RS422",1000000,"RS422",1000000,"RS422",1000000,"RS422",1000000,"RS422",1000000,"RS422",1000000,"RS422",1000000,"RS422",1000000,"RS422",1000000,"RS422",1000000,"RS422",1000000,"RS422",1000000,"RS422",1000000,"RS422",1000000,"RS422",1000000,"RS422",1000000,"RS422",1000000,"RS422",1000000,"RS422",1000000,"RS422",1000000,"RS422",1000000,"RS422",1000000,"RS422",1000000,"RS422",1000000,"RS422",1000000,"RS422",1000000,"RS422",1000000,"RS422",1000000,"RS422",1000000,"RS422",1000000,"RS422",1000000,"RS422",1000000,"RS422",1000000,"RS422",1000000,"RS422",1000000,"RS422",1000000,"RS422",1000000,"RS422",1000000,"RS422",1000000,"RS422",1000000,"RS422",1000000,"RS422",1000000,"RS422",1000000,"RS422",1000000,"RS422",1000000,"RS422",1000000,"RS422",1000000,"RS422",1000000,"RS422",1000000,"RS422",1000000,"RS422",1000000,"RS422",1000000,"RS422",1000000,"RS422",1000000,"RS422",1000000,"RS422",1000000,"RS422",1000000,"RS422",1000000,"RS422",1000000,"RS422",1000000,"RS422",1000000,"RS422",1000000,"RS422",1000000,"RS422",1000000,"RS422",1000000,"RS422",1000000,"RS422",1000000,"RS422",1000000,"RS422",1000000,"RS422",1000000,"RS422",1000000,"RS422",1000000,"RS422",1000000,"RS422",1000000,"RS422",1000000,"RS422",1000000,"RS422",1000000,"RS422",1000000,"RS422",1000000,"RS422",1000000,"RS422",1000000,"RS422",1000000,"RS422",1000000,"RS422",1000000,"RS422",1000000,"RS422",1000000,"RS422",1000000,"RS422",1000000,"RS422",1000000,"RS422",1000000,"RS422",1000000,"RS422",1000000,"RS422",1000000,"RS422",1000000,"RS422",1000000,"RS422",1000000,"RS422",1000000,"RS422",1000000,"RS422",1000000,"RS422",1000000,"RS422",1000000,"RS422",1000000,"RS422",1000000,"RS422",1000000,"RS422",1000000,"RS422",1000000,"RS422",1000000,"RS422",1000000,"RS422",1000000,"RS422",1000000,"RS422",1000000,"RS422",1000000,"RS422",1000000,"RS422",1000000,"RS422",1000000,"RS422",1000000,"RS422",1000000,"RS422",1000000,"RS422",1000000,"RS422",1000000,"RS422",1000000,"RS422",1000000,"RS422",1000000,"RS422",1000000,"RS422",1000000,"RS422",1000000,"RS422",1000000,"RS422",1000000,"RS422",1000000,"RS422",1000000,"RS422",1000000,"RS422",1000000,"RS422",1000000,"RS422",1000000,"RS422",1000000,"RS422",1000000,"RS422",1000000,"RS422",1000000,"RS422",1000000,"RS422",1000000,"RS422",1000000,"RS422",1000000,"RS422",1000000,"RS422",1000000,"RS422",1000000,"RS422",1000000,"RS422",1000000,"RS422",1000000,"RS422",1000000,"RS422",1000000,"RS422",1000000,"RS422",1000000,"RS422",1000000,"RS422",1000000,"RS422",1000000,"RS422",1000000,"RS422",1000000,"RS422",1000000,"RS422",1000000,"RS422",1000000,"RS422",1000000,"RS422",1000000,"RS422",1000000,"RS422",1000000,"RS422",1000000,"RS422",1000000,"RS422",1000000,"RS422",1000000,"RS422",1000000,"RS422",1000000,"RS422",1000000,"RS422",1000000,"RS422",1000000,"RS422",1000000,"RS422",1000000,"RS422",1000000,"RS422",1000000,"RS422",1000000,"RS422",1000000,"RS422",1000000,"RS422",1000000,"RS422",1000000,"RS422",1000000,"RS422",1000000,"RS422",1000000,"RS422",1000000,"RS422",1000000,"RS422",1000000,"RS422",1000000,"RS422",1000000,"RS422",1000000,"RS422",1000000,"RS422",1000000,"RS422",1000000,"RS422",1000000,"RS422",1000000,"RS422",1000000,"RS422",1000000,"RS422",1000000,"RS422",1000000,"RS422",1000000,"RS422",1000000,"RS422",1000000,"RS422",1000000,"RS422",1000000,"RS422",1000000,"RS422",1000000,"RS422",1000000,"RS422",1000000,"RS422",1000000,"RS422",1000000,"RS422",1000000,"RS422",1000000,"RS422",1000000,"RS422",1000000,"RS422",1000000,"RS422",1000000,"RS422",1000000,"RS422",1000000,"RS422",1000000,"RS422",1000000,"RS422",1000000,"RS422",1000000,"RS422",1000000,"RS422",1000000,"RS422",1000000,"RS422",1000000,"RS422",1000000,"RS422",1000000,"RS422",1000000,"RS422",1000000,"RS422",1000000,"RS422",1000000,"RS422",1000000,"RS422",1000000,"RS422",1000000,"RS422",1000000,"RS422",1000000,"RS422",1000000,"RS422",1000000,"RS422",1000000,"RS422",1000000,"RS422",1000000,"RS422",1000000,"RS422",1000000,"RS422",1000000,"RS422",1000000,"RS422",1000000,"RS422",1000000,"RS422",1000000,"RS422",1000000,"RS422",1000000,"RS422",1000000,"RS422",1000000,"RS422",1000000,"RS422",1000000,"RS422",1000000,"RS422",1000000,"RS422",1000000,"RS422",1000000,"RS422",1000000,"RS422",1000000,"RS422",1000000,"RS422",1000000,"RS422",1000000,"RS422",1000000,"RS422",1000000,"RS422",1000000,"RS422",1000000,"RS422",1000000,"RS422",1000000,"RS422",1000000,"RS422",1000000,"RS422",1000000,"RS422",1000000,"RS422",1000000,"RS422",1000000,"RS422",1000000,"RS422",1000000,"RS422",1000000,"RS422",1000000,"RS422",1000000,"RS422",1000000,"RS422",1000000,"RS422",1000000,"RS422",1000000,"RS422",1000000,"RS422",1000000,"RS422",1000000,"RS422",1000000,"RS422",1000000,"RS422",1000000,"RS422",1000000,"RS422",1000000,"RS422",1000000,"RS422",1000000,"RS422",1000000,"RS422",1000000,"RS422",1000000,"RS422",1000000,"RS422",1000000,"RS422",1000000,"RS422",1000000,"RS422",1000000,"RS422",1000000,"RS422",1000000,"RS422",1000000,"RS422",1000000,"RS422",1000000,"RS422",1000000,"RS422",1000000,"RS422",1000000,"RS422",1000000,"RS422",1000000,"RS422",1000000,"RS422",1000000,"RS422",1000000,"RS422",1000000,"RS422",1000000,"RS422",1000000,"RS422",1000000,"RS422",1000000,"RS422",1000000,"RS422",1000000,"RS422",1000000,"RS422",1000000,"RS422",1000000,"RS422",1000000,"RS422",1000000,"RS422",1000000,"RS422",1000000,"RS422",1000000,"RS422",1000000,"RS422",1000000,"RS422",1000000,"RS422",1000000,"RS422",1000000,"RS422",1000000,"RS422",1000000,"RS422",1000000,"RS422",1000000,"RS422",1000000,"RS422",1000000,"RS422",1000000,"RS422",1000000,"RS422",1000000,"RS422",1000000,"RS422",1000000,"RS422",1000000,"RS422",1000000,"RS422",1000000,"RS422",1000000,"RS422",1000000,"RS422",1000000,"RS422",1000000,"RS422",1000000,"RS422",1000000,"RS422",1000000,"RS422",1000000,"RS422",1000000,"RS422",1000000,"RS422",1000000,"RS422",1000000,"RS422",1000000,"RS422",1000000,"RS422",1000000,"RS422",1000000,"RS422",1000000,"RS422",1000000,"RS422",1000000,"RS422",1000000,"RS422",1000000,"RS422",1000000,"RS422",1000000,"RS422",1000000,"RS422",1000000,"RS422",1000000,"RS422",1000000,"RS422",1000000,"RS422",1000000,"RS422",1000000,"RS422",1000000,"RS422",1000000,"RS422",1000000,"RS422",1000000,"RS422",1000000,"RS422",1000000,"RS422",1000000,"RS422",1000000,"RS422",1000000,"RS422",1000000,"RS422",1000000,"RS422",1000000,"RS422",1000000,"RS422",1000000,"RS422",1000000,"RS422",1000000,"RS422",1000000,"RS422",1000000,"RS422",1000000,"RS422",1000000,"RS422",1000000,"RS422",1000000,"RS422",1000000,"RS422",1000000,"RS422",1000000,"RS422",1000000,"RS422",1000000,"RS422",1000000,"RS422",1000000,"RS422",1000000,"RS422",1000000,"RS422",1000000,"RS422",1000000,"RS422",1000000,"RS422",1000000,"RS422",1000000,"RS422",1000000,"RS422",1000000,"RS422",1000000,"RS422",1000000,"RS422",1000000,"RS422",1000000,"RS422",1000000,"RS422",1000000,"RS422",1000000,"RS422",1000000,"RS422",1000000,"RS422",1000000,"RS422",1000000,"RS422",1000000,"RS422",1000000,"RS422",1000000,"RS422",1000000,"RS422",1000000,"RS422",1000000,"RS422",1000000,"RS422",1000000,"RS422",1000000,"RS422",1000000,"RS422",1000000,"RS422",1000000,"RS422",1000000,"RS422",1000000,"RS422",1000000,"RS422",1000000,"RS422",1000000,"RS422",1000000,"RS422",1000000,"RS422",1000000,"RS422",1000000,"RS422",1000000,"RS422",1000000,"RS422",1000000,"RS422",1000000,"RS422",1000000,"RS422",1000000,"RS422",1000000,"RS422",1000000,"RS422",1000000,"RS422",1000000,"RS422",1000000,"RS422",1000000,"RS422",1000000,"RS422",1000000,"RS422",1000000,"RS422",1000000,"RS422",1000000,"RS422",1000000,"RS422",1000000,"RS422",1000000,"RS422",1000000,"RS422",1000000,"RS422",1000000,"RS422",1000000,"RS422",1000000,"RS422",1000000,"RS422",1000000,"RS422",1000000,"RS422",1000000,"RS422",1000000,"RS422",1000000,"RS422",1000000,"RS422",1000000,"RS422",1000000,"RS422",1000000,"RS422",1000000,"RS422",1000000,"RS422",1000000,"RS422",1000000,"RS422",1000000,"RS422",1000000,"RS422",1000000,"RS422",1000000,"RS422",1000000,"RS422",1000000,"RS422",1000000,"RS422",1000000,"RS422",1000000,"RS422",1000000,"RS422",1000000,"RS422",1000000,"RS422",1000000,"RS422",1000000,"RS422",1000000,"RS422",1000000,"RS422",1000000,"RS422",1000000,"RS422",1000000,"RS422",1000000,"RS422",1000000,"RS422",1000000,"RS422",1000000,"RS422",1000000,"RS422",1000000,"RS422",1000000,"RS422",1000000,"RS422",1000000,"RS422",1000000,"RS422",1000000,"RS422",1000000,"RS422",1000000,"RS422",1000000,"RS422",1000000,"RS422",1000000,"RS422",1000000,"RS422",1000000,"RS422",1000000,"RS422",1000000,"RS422",1000000,"RS422",1000000,"RS422",1000000,"RS422",1000000,"RS422",1000000,"RS422",1000000,"RS422",1000000,"RS422",1000000,"RS422",1000000,"RS422",1000000,"RS422",1000000,"RS422",1000000,"RS422",1000000,"RS422",1000000,"RS422",1000000,"RS422",1000000,"RS422",1000000,"RS422",1000000,"RS422",1000000,"RS422",1000000,"RS422",1000000,"RS422",1000000,"RS422",1000000,"RS422",1000000,"RS422",1000000,"RS422",1000000,"RS422",1000000,"RS422",1000000,"RS422",1000000,"RS422",1000000,"RS422",1000000,"RS422",1000000,"RS422",1000000,"RS422",1000000,"RS422",1000000,"RS422",1000000,"RS422",1000000,"RS422",1000000,"RS422",1000000,"RS422",1000000,"RS422",1000000,"RS422",1000000,"RS422",1000000,"RS422",1000000,"RS422",1000000,"RS422",1000000,"RS422",1000000,"RS422",1000000,"RS422",1000000,"RS422",1000000,"RS422",1000000,"RS422",1000000,"RS422",1000000,"RS422",1000000,"RS422",1000000,"RS422",1000000,"RS422",1000000,"RS422",1000000,"RS422",1000000,"RS422",1000000,"RS422",1000000,"RS422",1000000,"RS422",1000000,"RS422",1000000,"RS422",1000000,"RS422",1000000,"RS422",1000000,"RS422",1000000,"RS422",1000000,"RS422",1000000,"RS422",1000000,"RS422",1000000,"RS422",1000000,"RS422",1000000,"RS422",1000000,"RS422",1000000,"RS422",1000000,"RS422",1000000,"RS422",1000000,"RS422",1000000,"RS422",1000000,"RS422",1000000,"RS422",1000000,"RS422",1000000,"RS422",1000000,"RS422",1000000,"RS422",1000000,"RS422",1000000,"RS422",1000000,"RS422",1000000,"RS422",1000000,"RS422",1000000,"RS422",1000000,"RS422",1000000,"RS422",1000000,"RS422",1000000,"RS422",1000000,"RS422",1000000,"RS422",1000000,"RS422",1000000,"RS422",1000000,"RS422",1000000,"RS422",1000000,"RS422",1000000,"RS422",1000000,"RS422",1000000,"RS422",1000000,"RS422",1000000,"RS422",1000000,"RS422",1000000,"RS422",1000000,"RS422",1000000,"RS422",1000000,"RS422",1000000,"RS422",1000000,"RS422",1000000,"RS422",1000000,"RS422",1000000,"RS422",1000000,"RS422",1000000,"RS422",1000000,"RS422",1000000,"RS422",1000000,"RS422",1000000,"RS422",1000000,"RS422",1000000,"RS422",1000000,"RS422",1000000,"RS422",1000000,"RS422",1000000,"RS422",1000000,"RS422",1000000,"RS422",1000000,"RS422",1000000,"RS422",1000000,"RS422",1000000,"RS422",1000000,"RS422",1000000,"RS422",1000000,"RS422",1000000,"RS422",1000000,"RS422",1000000,"RS422",1000000,"RS422",1000000,"RS422",1000000,"RS422",1000000,"RS422",1000000,"RS422",1000000,"RS422",1000000,"RS422",1000000,"RS422",1000000,"RS422",1000000,"RS422",1000000,"RS422",1000000,"RS422",1000000,"RS422",1000000,"RS422",1000000,"RS422",1000000,"RS422",1000000,"RS422",1000000,"RS422",1000000,"RS422",1000000,"RS422",1000000,"RS422",1000000,"RS422",1000000,"RS422",1000000,"RS422",1000000,"RS422",1000000,"RS422",1000000,"RS422",1000000,"RS422",1000000,"RS422",1000000,"RS422",1000000,"RS422",1000000,"RS422",1000000,"RS422",1000000,"RS422",1000000,"RS422",1000000,"RS422",1000000,"RS422",1000000,"RS422",1000000,"RS422",1000000,"RS422",1000000,"RS422",1000000,"RS422",1000000,"RS422",1000000,"RS422",1000000,"RS422",1000000,"RS422",1000000,"RS422",1000000,"RS422",1000000,"RS422",1000000,"RS422",1000000,"RS422",1000000,"RS422",1000000,"RS422",1000000,"RS422",1000000,"RS422",1000000,"RS422",1000000,"RS422",1000000,"RS422",1000000,"RS422",1000000,"RS422",1000000,"RS422",1000000,"RS422",1000000,"RS422",1000000,"RS422",1000000,"RS422",1000000,"RS422",1000000,"RS422",1000000,"RS422",1000000,"RS422",1000000,"RS422",1000000,"RS422",1000000,"RS422",1000000,"RS422",1000000,"RS422",1000000,"RS422",1000000,"RS422",1000000,"RS422",1000000,"RS422",1000000,"RS422",1000000,"RS422",1000000,"RS422",1000000,"RS422",1000000,"RS422",1000000,"RS422",1000000,"RS422",1000000,"RS422",1000000,"RS422",1000000,"RS422",1000000,"RS422",1000000,"RS422",1000000,"RS422",1000000,"RS422",1000000,"RS422",1000000,"RS422",1000000,"RS422",1000000,"RS422",1000000,"RS422",1000000,"RS422",1000000,"RS422",1000000,"RS422",1000000,"RS422",1000000,"RS422",1000000,"RS422",1000000,"RS422",1000000,"RS422",1000000,"RS422",1000000,"RS422",1000000,"RS422",1000000,"RS422",1000000,"RS422",1000000,"RS422",1000000,"RS422",1000000,"RS422",1000000,"RS422",1000000,"RS422",1000000,"RS422",1000000,"RS422",1000000,"RS422",1000000,"RS422",1000000,"RS422",1000000,"RS422",1000000,"RS422",1000000,"RS422",1000000,"RS422",1000000,"RS422",1000000,"RS422",1000000,"RS422",1000000,"RS422",1000000,"RS422",1000000,"RS422",1000000,"RS422",1000000,"RS422",1000000,"RS422",1000000,"RS422",1000000,"RS422",1000000,"RS422",1000000,"RS422",1000000,"RS422",1000000,"RS422",1000000,"RS422",1000000,"RS422",1000000,"RS422",1000000,"RS422",1000000,"RS422",1000000,"RS422",1000000,"RS422",1000000,"RS422",1000000,"RS422",1000000,"RS422",1000000,"RS422",1000000,"RS422",1000000,"RS422",1000000,"RS422",1000000,"RS422",1000000,"RS422",1000000,"RS422",1000000,"RS422",1000000,"RS422",1000000,"RS422",1000000,"RS422",1000000,"RS422",1000000,"RS422",1000000,"RS422",1000000,"RS422",1000000,"RS422",1000000,"RS422",1000000,"RS422",1000000,"RS422",1000000,"RS422",1000000,"RS422",1000000,"RS422",1000000,"RS422",1000000,"RS422",1000000,"RS422",1000000,"RS422",1000000,"RS422",1000000,"RS422",1000000,"RS422",1000000,"RS422",1000000,"RS422",1000000,"RS422",1000000,"RS422",1000000,"RS422",1000000,"RS422",1000000,"RS422",1000000,"RS422",1000000,"RS422",1000000,"RS422",1000000,"RS422",1000000,"RS422",1000000,"RS422",1000000,"RS422",1000000,"RS422",1000000,"RS422",1000000,"RS422",1000000,"RS422",1000000,"RS422",1000000,"RS422",1000000,"RS422",1000000,"RS422",1000000,"RS422",1000000,"RS422",1000000,"RS422",1000000,"RS422",1000000,"RS422",1000000,"RS422",1000000,"RS422",1000000,"RS422",1000000,"RS422",1000000,"RS422",1000000,"RS422",1000000,"RS422",1000000,"RS422",1000000,"RS422",1000000,"RS422",1000000,"RS422",1000000,"RS422",1000000,"RS422",1000000,"RS422",1000000,"RS422",1000000,"RS422",1000000,"RS422",1000000,"RS422",1000000,"RS422",1000000,"RS422",1000000,"RS422",1000000,"RS422",1000000,"RS422",1000000,"RS422",1000000,"RS422",1000000,"RS422",1000000,"RS422",1000000,"RS422",1000000,"RS422",1000000,"RS422",1000000,"RS422",1000000,"RS422",1000000,"RS422",1000000,"RS422",1000000,"RS422",1000000,"RS422",1000000,"RS422",1000000,"RS422",1000000,"RS422",1000000,"RS422",1000000,"RS422",1000000,"RS422",1000000,"RS422",1000000,"RS422",1000000,"RS422",1000000,"RS422",1000000,"RS422",1000000,"RS422",1000000,"RS422",1000000,"RS422",1000000,"RS422",1000000,"RS422",1000000,"RS422",1000000,"RS422",1000000,"RS422",1000000,"RS422",1000000,"RS422",1000000,"RS422",1000000,"RS422",1000000,"RS422",1000000,"RS422",1000000,"RS422",1000000,"RS422",1000000,"RS422",1000000,"RS422",1000000,"RS422",1000000,"RS422",1000000,"RS422",1000000,"RS422",1000000,"RS422",1000000,"RS422",1000000,"RS422",1000000,"RS422",1000000,"RS422",1000000,"RS422",1000000,"RS422",1000000,"RS422",1000000,"RS422",1000000,"RS422",1000000,"RS422",1000000,"RS422",1000000,"RS422",1000000,"RS422",1000000,"RS422",1000000,"RS422",1000000,"RS422",1000000,"RS422",1000000,"RS422",1000000,"RS422",1000000,"RS422",1000000,"RS422",1000000,"RS422",1000000,"RS422",1000000,"RS422",1000000,"RS422",1000000,"RS422",1000000,"RS422",1000000,"RS422",1000000,"RS422",1000000,"RS422",1000000,"RS422",1000000,"RS422",1000000,"RS422",1000000,"RS422",1000000,"RS422",1000000,"RS422",1000000,"RS422",1000000,"RS422",1000000,"RS422",1000000,"RS422",1000000,"RS422",1000000,"RS422",1000000,"RS422",1000000,"RS422",1000000,"RS422",1000000,"RS422",1000000,"RS422",1000000,"RS422",1000000,"RS422",1000000,"RS422",1000000,"RS422",1000000,"RS422",1000000,"RS422",1000000,"RS422",1000000,"RS422",1000000,"RS422",1000000,"RS422",1000000,"RS422",1000000,"RS422",1000000,"RS422",1000000,"RS422",1000000,"RS422",1000000,"RS422",1000000,"RS422",1000000,"RS422",1000000,"RS422",1000000,"RS422",1000000,"RS422",1000000,"RS422",1000000,"RS422",1000000,"RS422",1000000,"RS422",1000000,"RS422",1000000,"RS422",1000000,"RS422",1000000,"RS422",1000000,"RS422",1000000,"RS422",1000000,"RS422",1000000,"RS422",1000000,"RS422",1000000,"RS422",1000000,"RS422",1000000,"RS422",1000000,"RS422",1000000,"RS422",1000000,"RS422",1000000,"RS422",1000000,"RS422",1000000,"RS422",1000000,"RS422",1000000,"RS422",1000000,"RS422",1000000,"RS422",1000000,"RS422",1000000,"RS422",1000000,"RS422",1000000,"RS422",1000000,"RS422",1000000,"RS422",1000000,"RS422",1000000,"RS422",1000000,"RS422",1000000,"RS422",1000000,"RS422",1000000,"RS422",1000000,"RS422",1000000,"RS422",1000000,"RS422",1000000,"RS422",1000000,"RS422",1000000,"RS422",1000000,"RS422",1000000,"RS422",1000000,"RS422",1000000,"RS422",1000000,"RS422",1000000,"RS422",1000000,"RS422",1000000,"RS422",1000000,"RS422",1000000,"RS422",1000000,"RS422",1000000,"RS422",1000000,"RS422",1000000,"RS422",1000000,"RS422",1000000,"RS422",1000000,"RS422",1000000,"RS422",1000000,"RS422",1000000,"RS422",1000000,"RS422",1000000,"RS422",1000000,"RS422",1000000,"RS422",1000000,"RS422",1000000,"RS422",1000000,"RS422",1000000,"RS422",1000000,"RS422",1000000,"RS422",1000000,"RS422",1000000,"RS422",1000000,"RS422",1000000,"RS422",1000000,"RS422",1000000,"RS422",1000000,"RS422",1000000,"RS422",1000000,"RS422",1000000,"RS422",1000000,"RS422",1000000,"RS422",1000000,"RS422",1000000,"RS422",1000000,"RS422",1000000,"RS422",1000000,"RS422",1000000,"RS422",1000000,"RS422",1000000,"RS422",1000000,"RS422",1000000,"RS422",1000000,"RS422",1000000,"RS422",1000000,"RS422",1000000,"RS422",1000000,"RS422",1000000,"RS422",1000000,"RS422",1000000,"RS422",1000000,"RS422",1000000,"RS422",1000000,"RS422",1000000,"RS422",1000000,"RS422",1000000,"RS422",1000000,"RS422",1000000,"RS422",1000000,"RS422",1000000,"RS422",1000000,"RS422",1000000,"RS422",1000000,"RS422",1000000,"RS422",1000000,"RS422",1000000,"RS422",1000000,"RS422",1000000,"RS422",1000000,"RS422",1000000,"RS422",1000000,"RS422",1000000,"RS422",1000000,"RS422",1000000,"RS422",1000000,"RS422",1000000,"RS422",1000000,"RS422",1000000,"RS422",1000000,"RS422",1000000,"RS422",1000000,"RS422",1000000,"RS422",1000000,"RS422",1000000,"RS422",1000000,"RS422",1000000,"RS422",1000000,"RS422",1000000,"RS422",1000000,"RS422",1000000,"RS422",1000000,"RS422",1000000,"RS422",1000000,"RS422",1000000,"RS422",1000000,"RS422",1000000,"RS422",1000000,"RS422",1000000,"RS422",1000000,"RS422",1000000,"RS422",1000000,"RS422",1000000,"RS422",1000000,"RS422",1000000,"RS422",1000000,"RS422",1000000,"RS422",1000000,"RS422",1000000,"RS422",1000000,"RS422",1000000,"RS422",1000000,"RS422",1000000,"RS422",1000000,"RS422",1000000,"RS422",1000000,"RS422",1000000,"RS422",1000000,"RS422",1000000,"RS422",1000000,"RS422",1000000,"RS422",1000000,"RS422",1000000,"RS422",1000000,"RS422",1000000,"RS422",1000000,"RS422",1000000,"RS422",1000000,"RS422",1000000,"RS422",1000000,"RS422",1000000,"RS422",1000000,"RS422",1000000,"RS422",1000000,"RS422",1000000,"RS422",1000000,"RS422",1000000,"RS422",1000000,"RS422",1000000,"RS422",1000000,"RS422",1000000,"RS422",1000000,"RS422",1000000,"RS422",1000000,"RS422",1000000,"RS422",1000000,"RS422",1000000,"RS422",1000000,"RS422",1000000,"RS422",1000000,"RS422",1000000,"RS422",1000000,"RS422",1000000,"RS422",1000000,"RS422",1000000,"RS422",1000000,"RS422",1000000,"RS422",1000000,"RS422",1000000,"RS422",1000000,"RS422",1000000,"RS422",1000000,"RS422",1000000,"RS422",1000000,"RS422",1000000,"RS422",1000000,"RS422",1000000,"RS422",1000000,"RS422",1000000,"RS422",1000000,"RS422",1000000,"RS422",1000000,"RS422",1000000,"RS422",1000000,"RS422",1000000,"RS422",1000000,"RS422",1000000,"RS422",1000000,"RS422",1000000,"RS422",1000000,"RS422",1000000,"RS422",1000000,"RS422",1000000,"RS422",1000000,"RS422",1000000,"RS422",1000000,"RS422",1000000,"RS422",1000000,"RS422",1000000,"RS422",1000000,"RS422",1000000,"RS422",1000000,"RS422",1000000,"RS422",1000000,"RS422",1000000,"RS422",1000000,"RS422",1000000,"RS422",1000000,"RS422",1000000,"RS422",1000000,"RS422",1000000,"RS422",1000000,"RS422",1000000,"RS422",1000000,"RS422",1000000,"RS422",1000000,"RS422",1000000,"RS422",1000000,"RS422",1000000,"RS422",1000000,"RS422",1000000,"RS422",1000000,"RS422",1000000,"RS422",1000000,"RS422",1000000,"RS422",1000000,"RS422",1000000,"RS422",1000000,"RS422",1000000,"RS422",1000000,"RS422",1000000,"RS422",1000000,"RS422",1000000,"RS422",1000000,"RS422",1000000,"RS422",1000000,"RS422",1000000,"RS422",1000000,"RS422",1000000,"RS422",1000000,"RS422",1000000,"RS422",1000000,"RS422",1000000,"RS422",1000000,"RS422",1000000,"RS422",1000000,"RS422",1000000,"RS422",1000000,"RS422",1000000,"RS422",1000000,"RS422",1000000,"RS422",1000000,"RS422",1000000,"RS422",1000000,"RS422",1000000,"RS422",1000000,"RS422",1000000,"RS422",1000000,"RS422",1000000,"RS422",1000000,"RS422",1000000,"RS422",1000000,"RS422",1000000,"RS422",1000000,"RS422",1000000,"RS422",1000000,"RS422",1000000,"RS422",1000000,"RS422",1000000,"RS422",1000000,"RS422",1000000,"RS422",1000000,"RS422",1000000,"RS422",1000000,"RS422",1000000,"RS422",1000000,"RS422",1000000,"RS422",1000000,"RS422",1000000,"RS422",1000000,"RS422",1000000,"RS422",1000000,"RS422",1000000,"RS422",1000000,"RS422",1000000,"RS422",1000000,"RS422",1000000,"RS422",1000000,"RS422",1000000,"RS422",1000000,"RS422",1000000,"RS422",1000000,"RS422",1000000,"RS422",1000000,"RS422",1000000,"RS422",1000000,"RS422",1000000,"RS422",1000000,"RS422",1000000,"RS422",1000000,"RS422",1000000,"RS422",1000000,"RS422",1000000,"RS422",1000000,"RS422",1000000,"RS422",1000000,"RS422",1000000,"RS422",1000000,"RS422",1000000,"RS422",1000000,"RS422",1000000,"RS422",1000000,"RS422",1000000,"RS422",1000000,"RS422",1000000,"RS422",1000000,"RS422",1000000,"RS422",1000000,"RS422",1000000,"RS422",1000000,"RS422",1000000,"RS422",1000000,"RS422",1000000,"RS422",1000000,"RS422",1000000,"RS422",1000000,"RS422",1000000,"RS422",1000000,"RS422",1000000,"RS422",1000000,"RS422",1000000,"RS422",1000000,"RS422",1000000,"RS422",1000000,"RS422",1000000,"RS422",1000000,"RS422",1000000,"RS422",1000000,"RS422",1000000,"RS422",1000000,"RS422",1000000,"RS422",1000000,"RS422",1000000,"RS422",1000000,"RS422",1000000,"RS422",1000000,"RS422",1000000,"RS422",1000000,"RS422",1000000,"RS422",1000000,"RS422",1000000,"RS422",1000000,"RS422",1000000,"RS422",1000000,"RS422",1000000,"RS422",1000000,"RS422",1000000,"RS422",1000000,"RS422",1000000,"RS422",1000000,"RS422",1000000,"RS422",1000000,"RS422",1000000,"RS422",1000000,"RS422",1000000,"RS422",1000000,"RS422",1000000,"RS422",1000000,"RS422",1000000,"RS422",1000000,"RS422",1000000,"RS422",1000000,"RS422",1000000,"RS422",1000000,"RS422",1000000,"RS422",1000000,"RS422",1000000,"RS422",1000000,"RS422",1000000,"RS422",1000000,"RS422",1000000,"RS422",1000000,"RS422",1000000,"RS422",1000000,"RS422",1000000,"RS422",1000000,"RS422",1000000,"RS422",1000000,"RS422",1000000,"RS422",1000000,"RS422",1000000,"RS422",1000000,"RS422",1000000,"RS422",1000000,"RS422",1000000,"RS422",1000000,"RS422",1000000,"RS422",1000000,"RS422",1000000,"RS422",1000000,"RS422",1000000,"RS422",1000000,"RS422",1000000,"RS422",1000000,"RS422",1000000,"RS422",1000000,"RS422",1000000,"RS422",1000000,"RS422",1000000,"RS422",1000000,"RS422",1000000,"RS422",1000000,"RS422",1000000,"RS422",1000000,"RS422",1000000,"RS422",1000000,"RS422",1000000,"RS422",1000000,"RS422",1000000,"RS422",1000000,"RS422",1000000,"RS422",1000000,"RS422",1000000,"RS422",1000000,"RS422",1000000,"RS422",1000000,"RS422",1000000,"RS422",1000000,"RS422",1000000,"RS422",1000000,"RS422",1000000,"RS422",1000000,"RS422",1000000,"RS422",1000000,"RS422",1000000,"RS422",1000000,"RS422",1000000,"RS422",1000000,"RS422",1000000,"RS422",1000000,"RS422",1000000,"RS422",1000000,"RS422",1000000,"RS422",1000000,"RS422",1000000,"RS422",1000000,"RS422",1000000,"RS422",1000000,"RS422",1000000,"RS422",1000000,"RS422",1000000,"RS422",1000000,"RS422",1000000,"RS422",1000000,"RS422",1000000,"RS422",1000000,"RS422",1000000,"RS422",1000000,"RS422",1000000,"RS422",1000000,"RS422",1000000,"RS422",1000000,"RS422",1000000,"RS422",1000000,"RS422",1000000,"RS422",1000000,"RS422",1000000,"RS422",1000000,"RS422",1000000,"RS422",1000000,"RS422",1000000,"RS422",1000000,"RS422",1000000,"RS422",1000000,"RS422",1000000,"RS422",1000000,"RS422",1000000,"RS422",1000000,"RS422",1000000,"RS422",1000000,"RS422",1000000,"RS422",1000000,"RS422",1000000,"RS422",1000000,"RS422",1000000,"RS422",1000000,"RS422",1000000,"RS422",1000000,"RS422",1000000,"RS422",1000000,"RS422",1000000,"RS422",1000000,"RS422",1000000,"RS422",1000000,"RS422",1000000,"RS422",1000000,"RS422",1000000,"RS422",1000000,"RS422",1000000,"RS422",1000000,"RS422",1000000,"RS422",1000000,"RS422",1000000,"RS422",1000000,"RS422",1000000,"RS422",1000000,"RS422",1000000,"RS422",1000000,"RS422",1000000,"RS422",1000000,"RS422",1000000,"RS422",1000000,"RS422",1000000,"RS422",1000000,"RS422",1000000,"RS422",1000000,"RS422",1000000,"RS422",1000000,"RS422",1000000,"RS422",1000000,"RS422",1000000,"RS422",1000000,"RS422",1000000,"RS422",1000000,"RS422",1000000,"RS422",1000000,"RS422",1000000,"RS422",1000000,"RS422",1000000,"RS422",1000000,"RS422",1000000,"RS422",1000000,"RS422",1000000,"RS422",1000000,"RS422",1000000,"RS422",1000000,"RS422",1000000,"RS422",1000000,"RS422",1000000,"RS422",1000000,"RS422",1000000,"RS422",1000000,"RS422",1000000,"RS422",1000000,"RS422",1000000,"RS422",1000000,"RS422",1000000,"RS422",1000000,"RS422",1000000,"RS422",1000000,"RS422",1000000,"RS422",1000000,"RS422",1000000,"RS422",1000000,"RS422",1000000,"RS422",1000000,"RS422",1000000,"RS422",1000000,"RS422",1000000,"RS422",1000000,"RS422",1000000,"RS422",1000000,"RS422",1000000,"RS422",1000000,"RS422",1000000,"RS422",1000000,"RS422",1000000,"RS422",1000000,"RS422",1000000,"RS422",1000000,"RS422",1000000,"RS422",1000000,"RS422",1000000,"RS422",1000000,"RS422",1000000,"RS422",1000000,"RS422",1000000,"RS422",1000000,"RS422",1000000,"RS422",1000000,"RS422",1000000,"RS422",1000000,"RS422",1000000,"RS422",1000000,"RS422",1000000,"RS422",1000000,"RS422",1000000,"RS422",1000000,"RS422",1000000,"RS422",1000000,"RS422",1000000,"RS422",1000000,"RS422",1000000,"RS422",1000000,"RS422",1000000,"RS422",1000000,"RS422",1000000,"RS422",1000000,"RS422",1000000,"RS422",1000000,"RS422",1000000,"RS422",1000000,"RS422",1000000,"RS422",1000000,"RS422",1000000,"RS422",1000000,"RS422",1000000,"RS422",1000000,"RS422",1000000,"RS422",1000000,"RS422",1000000,"RS422",1000000,"RS422",1000000,"RS422",1000000,"RS422",1000000,"RS422",1000000,"RS422",1000000,"RS422",1000000,"RS422",1000000,"RS422",1000000,"RS422",1000000,"RS422",1000000,"RS422",1000000,"RS422",1000000,"RS422",1000000,"RS422",1000000,"RS422",1000000,"RS422",1000000,"RS422",1000000,"RS422",1000000,"RS422",1000000,"RS422",1000000,"RS422",1000000,"RS422",1000000,"RS422",1000000,"RS422",1000000,"RS422",1000000,"RS422",1000000,"RS422",1000000,"RS422",1000000,"RS422",1000000,"RS422",1000000,"RS422",1000000,"RS422",1000000,"RS422",1000000,"RS422",1000000,"RS422",1000000,"RS422",1000000,"RS422",1000000,"RS422",1000000,"RS422",1000000,"RS422",1000000,"RS422",1000000,"RS422",1000000,"RS422",1000000,"RS422",1000000,"RS422",1000000,"RS422",1000000,"RS422",1000000,"RS422",1000000,"RS422",1000000,"RS422",1000000,"RS422",1000000,"RS422",1000000,"RS422",1000000,"RS422",1000000,"RS422",1000000,"RS422",1000000,"RS422",1000000,"RS422",1000000,"RS422",1000000,"RS422",1000000,"RS422",1000000,"RS422",1000000,"RS422",1000000,"RS422",1000000,"RS422",1000000,"RS422",1000000,"RS422",1000000,"RS422",1000000,"RS422",1000000,"RS422",1000000,"RS422",1000000,"RS422",1000000,"RS422",1000000,"RS422",1000000,"RS422",1000000,"RS422",1000000,"RS422",1000000,"RS422",1000000,"RS422",1000000,"RS422",1000000,"RS422",1000000,"RS422",1000000,"RS422",1000000,"RS422",1000000,"RS422",1000000,"RS422",1000000,"RS422",1000000,"RS422",1000000,"RS422",1000000,"RS422",1000000,"RS422",1000000,"RS422",1000000,"RS422",1000000,"RS422",1000000,"RS422",1000000,"RS422",1000000,"RS422",1000000,"RS422",1000000,"RS422",1000000,"RS422",1000000,"RS422",1000000,"RS422",1000000,"RS422",1000000,"RS422",1000000,"RS422",1000000,"RS422",1000000,"RS422",1000000,"RS422",1000000,"RS422",1000000,"RS422",1000000,"RS422",1000000,"RS422",1000000,"RS422",1000000,"RS422",1000000,"RS422",1000000,"RS422",1000000,"RS422",1000000,"RS422",1000000,"RS422",1000000,"RS422",1000000,"RS422",1000000,"RS422",1000000,"RS422",1000000,"RS422",1000000,"RS422",1000000,"RS422",1000000,"RS422",1000000,"RS422",1000000,"RS422",1000000,"RS422",1000000,"RS422",1000000,"RS422",1000000,"RS422",1000000,"RS422",1000000,"RS422",1000000,"RS422",1000000,"RS422",1000000,"RS422",1000000,"RS422",1000000,"RS422",1000000,"RS422",1000000,"RS422",1000000,"RS422",1000000,"RS422",1000000,"RS422",1000000,"RS422",1000000,"RS422",1000000,"RS422",1000000,"RS422",1000000,"RS422",1000000,"RS422",1000000,"RS422",1000000,"RS422",1000000,"RS422",1000000,"RS422",1000000,"RS422",1000000,"RS422",1000000,"RS422",1000000,"RS422",1000000,"RS422",1000000,"RS422",1000000,"RS422",1000000,"RS422",1000000,"RS422",1000000,"RS422",1000000,"RS422",1000000,"RS422",1000000,"RS422",1000000,"RS422",1000000,"RS422",1000000,"RS422",1000000,"RS422",1000000,"RS422",1000000,"RS422",1000000,"RS422",1000000,"RS422",1000000,"RS422",1000000,"RS422",1000000,"RS422",1000000,"RS422",1000000,"RS422",1000000,"RS422",1000000,"RS422",1000000,"RS422",1000000,"RS422",1000000,"RS422",1000000,"RS422",1000000,"RS422",1000000,"RS422",1000000,"RS422",1000000,"RS422",1000000,"RS422",1000000,"RS422",1000000,"RS422",1000000,"RS422",1000000,"RS422",1000000,"RS422",1000000,"RS422",1000000,"RS422",1000000,"RS422",1000000,"RS422",1000000,"RS422",1000000,"RS422",1000000,"RS422",1000000,"RS422",1000000,"RS422",1000000,"RS422",1000000,"RS422",1000000,"RS422",1000000,"RS422",1000000,"RS422",1000000,"RS422",1000000,"RS422",1000000,"RS422",1000000,"RS422",1000000,"RS422",1000000,"RS422",1000000,"RS422",1000000,"RS422",1000000,"RS422",1000000,"RS422",1000000,"RS422",1000000,"RS422",1000000,"RS422",1000000,"RS422",1000000,"RS422",1000000,"RS422",1000000,"RS422",1000000,"RS422",1000000,"RS422",1000000,"RS422",1000000,"RS422",1000000,"RS422",1000000,"RS422",1000000,"RS422",1000000,"RS422",1000000,"RS422",1000000,"RS422",1000000,"RS422",1000000,"RS422",1000000,"RS422",1000000,"RS422",1000000,"RS422",1000000,"RS422",1000000,"RS422",1000000,"RS422",1000000,"RS422",1000000,"RS422",1000000,"RS422",1000000,"RS422",1000000,"RS422",1000000,"RS422",1000000,"RS422",1000000,"RS422",1000000,"RS422",1000000,"RS422",1000000,"RS422",1000000,"RS422",1000000,"RS422",1000000,"RS422",1000000,"RS422",1000000,"RS422",1000000,"RS422",1000000,"RS422",1000000,"RS422",1000000,"RS422",1000000,"RS422",1000000,"RS422",1000000,"RS422",1000000,"RS422",1000000,"RS422",1000000,"RS422",1000000,"RS422",1000000,"RS422",1000000,"RS422",1000000,"RS422",1000000,"RS422",1000000,"RS422",1000000,"RS422",1000000,"RS422",1000000,"RS422",1000000,"RS422",1000000,"RS422",1000000,"RS422",1000000,"RS422",1000000,"RS422",1000000,"RS422",1000000,"RS422",1000000,"RS422",1000000,"RS422",1000000,"RS422",1000000,"RS422",1000000,"RS422",1000000,"RS422",1000000,"RS422",1000000,"RS422",1000000,"RS422",1000000,"RS422",1000000,"RS422",1000000,"RS422",1000000,"RS422",1000000,"RS422",1000000,"RS422",1000000,"RS422",1000000,"RS422",1000000,"RS422",1000000,"RS422",1000000,"RS422",1000000,"RS422",1000000,"RS422",1000000,"RS422",1000000,"RS422",1000000,"RS422",1000000,"RS422",1000000,"RS422",1000000,"RS422",1000000,"RS422",1000000,"RS422",1000000,"RS422",1000000,"RS422",1000000,"RS422",1000000,"RS422",1000000,"RS422",1000000,"RS422",1000000,"RS422",1000000,"RS422",1000000,"RS422",1000000,"RS422",1000000,"RS422",1000000,"RS422",1000000,"RS422",1000000,"RS422",1000000,"RS422",1000000,"RS422",1000000,"RS422",1000000,"RS422",1000000,"RS422",1000000,"RS422",1000000,"RS422",1000000,"RS422",1000000,"RS422",1000000,"RS422",1000000,"RS422",1000000,"RS422",1000000,"RS422",1000000,"RS422",1000000,"RS422",1000000,"RS422",1000000,"RS422",1000000,"RS422",1000000,"RS422",1000000,"RS422",1000000,"RS422",1000000,"RS422",1000000,"RS422",1000000,"RS422",1000000,"RS422",1000000,"RS422",1000000,"RS422",1000000,"RS422",1000000,"RS422",1000000,"RS422",1000000,"RS422",1000000,"RS422",1000000,"RS422",1000000,"RS422",1000000,"RS422",1000000,"RS422",1000000,"RS422",1000000,"RS422",1000000,"RS422",1000000,"RS422",1000000,"RS422",1000000,"RS422",1000000,"RS422",1000000,"RS422",1000000,"RS422",1000000,"RS422",1000000,"RS422",1000000,"RS422",1000000,"RS422",1000000,"RS422",1000000,"RS422",1000000,"RS422",1000000,"RS422",1000000,"RS422",1000000,"RS422",1000000,"RS422",1000000,"RS422",1000000,"RS422",1000000,"RS422",1000000,"RS422",1000000,"RS422",1000000,"RS422",1000000,"RS422",1000000,"RS422",1000000,"RS422",1000000,"RS422",1000000,"RS422",1000000,"RS422",1000000,"RS422",1000000,"RS422",1000000,"RS422",1000000,"RS422",1000000,"RS422",1000000,"RS422",1000000,"RS422",1000000,"RS422",1000000,"RS422",1000000,"RS422",1000000,"RS422",1000000,"RS422",1000000,"RS422",1000000,"RS422",1000000,"RS422",1000000,"RS422",1000000,"RS422",1000000,"RS422",1000000,"RS422",1000000,"RS422",1000000,"RS422",1000000,"RS422",1000000,"RS422",1000000,"RS422",1000000,"RS422",1000000,"RS422",1000000,"RS422",1000000,"RS422",1000000,"RS422",1000000,"RS422",1000000,"RS422",1000000,"RS422",1000000,"RS422",1000000,"RS422",1000000,"RS422",1000000,"RS422",1000000,"RS422",1000000,"RS422",1000000,"RS422",1000000,"RS422",1000000,"RS422",1000000,"RS422",1000000,"RS422",1000000,"RS422",1000000,"RS422",1000000,"RS422",1000000,"RS422",1000000,"RS422",1000000,"RS422",1000000,"RS422",1000000,"RS422",1000000,"RS422",1000000,"RS422",1000000,"RS422",1000000,"RS422",1000000,"RS422",1000000,"RS422",1000000,"RS422",1000000,"RS422",1000000,"RS422",1000000,"RS422",1000000,"RS422",1000000,"RS422",1000000,"RS422",1000000,"RS422",1000000,"RS422",1000000,"RS422",1000000,"RS422",1000000,"RS422",1000000,"RS422",1000000,"RS422",1000000,"RS422",1000000,"RS422",1000000,"RS422",1000000,"RS422",1000000,"RS422",1000000,"RS422",1000000,"RS422",1000000,"RS422",1000000,"RS422",1000000,"RS422",1000000,"RS422",1000000,"RS422",1000000,"RS422",1000000,"RS422",1000000,"RS422",1000000,"RS422",1000000,"RS422",1000000,"RS422",1000000,"RS422",1000000,"RS422",1000000,"RS422",1000000,"RS422",1000000,"RS422",1000000,"RS422",1000000,"RS422",1000000,"RS422",1000000,"RS422",1000000,"RS422",1000000,"RS422",1000000,"RS422",1000000,"RS422",1000000,"RS422",1000000,"RS422",1000000,"RS422",1000000,"RS422",1000000,"RS422",1000000,"RS422",1000000,"RS422",1000000,"RS422",1000000,"RS422",1000000,"RS422",1000000,"RS422",1000000,"RS422",1000000,"RS422",1000000,"RS422",1000000,"RS422",1000000,"RS422",1000000,"RS422",1000000,"RS422",1000000,"RS422",1000000,"RS422",1000000,"RS422",1000000,"RS422",1000000,"RS422",1000000,"RS422",1000000,"RS422",1000000,"RS422",1000000,"RS422",1000000,"RS422",1000000,"RS422",1000000,"RS422",1000000,"RS422",1000000,"RS422",1000000,"RS422",1000000,"RS422",1000000,"RS422",1000000,"RS422",1000000,"RS422",1000000,"RS422",1000000,"RS422",1000000,"RS422",1000000,"RS422",1000000,"RS422",1000000,"RS422",1000000,"RS422",1000000,"RS422",1000000,"RS422",1000000,"RS422",1000000,"RS422",1000000,"RS422",1000000,"RS422",1000000,"RS422",1000000,"RS422",1000000,"RS422",1000000,"RS422",1000000,"RS422",1000000,"RS422",1000000,"RS422",1000000,"RS422",1000000,"RS422",1000000,"RS422",1000000,"RS422",1000000,"RS422",1000000,"RS422",1000000,"RS422",1000000,"RS422",1000000,"RS422",1000000,"RS422",1000000,"RS422",1000000,"RS422",1000000,"RS422",1000000,"RS422",1000000,"RS422",1000000,"RS422",1000000,"RS422",1000000,"RS422",1000000,"RS422",1000000,"RS422",1000000,"RS422",1000000,"RS422",1000000,"RS422",1000000,"RS422",1000000,"RS422",1000000,"RS422",1000000,"RS422",1000000,"RS422",1000000,"RS422",1000000,"RS422",1000000,"RS422",1000000,"RS422",1000000,"RS422",1000000,"RS422",1000000,"RS422",1000000,"RS422",1000000,"RS422",1000000,"RS422",1000000,"RS422",1000000,"RS422",1000000,"RS422",1000000,"RS422",1000000,"RS422",1000000,"RS422",1000000,"RS422",1000000,"RS422",1000000,"RS422",1000000,"RS422",1000000,"RS422",1000000,"RS422",1000000,"RS422",1000000,"RS422",1000000,"RS422",1000000,"RS422",1000000,"RS422",1000000,"RS422",1000000,"RS422",1000000,"RS422",1000000,"RS422",1000000,"RS422",1000000,"RS422",1000000,"RS422",1000000,"RS422",1000000,"RS422",1000000,"RS422",1000000,"RS422",1000000,"RS422",1000000,"RS422",1000000,"RS422",1000000,"RS422",1000000,"RS422",1000000,"RS422",1000000,"RS422",1000000,"RS422",1000000,"RS422",1000000,"RS422",1000000,"RS422",1000000,"RS422",1000000,"RS422",1000000,"RS422",1000000,"RS422",1000000,"RS422",1000000,"RS422",1000000,"RS422",1000000,"RS422",1000000,"RS422",1000000,"RS422",1000000,"RS422",1000000,"RS422",1000000,"RS422",1000000,"RS422",1000000,"RS422",1000000,"RS422",1000000,"RS422",1000000,"RS422",1000000,"RS422",1000000,"RS422",1000000,"RS422",1000000,"RS422",1000000,"RS422",1000000,"RS422",1000000,"RS422",1000000,"RS422",1000000,"RS422",1000000,"RS422",1000000,"RS422",1000000,"RS422",1000000,"RS422",1000000,"RS422",1000000,"RS422",1000000,"RS422",1000000,"RS422",1000000,"RS422",1000000,"RS422",1000000,"RS422",1000000,"RS422",1000000,"RS422",1000000,"RS422",1000000,"RS422",1000000,"RS422",1000000,"RS422",1000000,"RS422",1000000,"RS422",1000000,"RS422",1000000,"RS422",1000000,"RS422",1000000,"RS422",1000000,"RS422",1000000,"RS422",1000000,"RS422",1000000,"RS422",1000000,"RS422",1000000,"RS422",1000000,"RS422",1000000,"RS422",1000000,"RS422",1000000,"RS422",1000000,"RS422",1000000,"RS422",1000000,"RS422",1000000,"RS422",1000000,"RS422",1000000,"RS422",1000000,"RS422",1000000,"RS422",1000000,"RS422",1000000,"RS422",1000000,"RS422",1000000,"RS422",1000000,"RS422",1000000,"RS422",1000000,"RS422",1000000,"RS422",1000000,"RS422",1000000,"RS422",1000000,"RS422",1000000,"RS422",1000000,"RS422",1000000,"RS422",1000000,"RS422",1000000,"RS422",1000000,"RS422",1000000,"RS422",1000000,"RS422",1000000,"RS422",1000000,"RS422",1000000,"RS422",1000000,"RS422",1000000,"RS422",1000000,"RS422",1000000,"RS422",1000000,"RS422",1000000,"RS422",1000000,"RS422",1000000,"RS422",1000000,"RS422",1000000,"RS422",1000000,"RS422",1000000,"RS422",1000000,"RS422",1000000,"RS422",1000000,"RS422",1000000,"RS422",1000000,"RS422",1000000,"RS422",1000000,"RS422",1000000,"RS422",1000000,"RS422",1000000,"RS422",1000000,"RS422",1000000,"RS422",1000000,"RS422",1000000,"RS422",1000000,"RS422",1000000,"RS422",1000000,"RS422",1000000,"RS422",1000000,"RS422",1000000,"RS422",1000000,"RS422",1000000,"RS422",1000000,"RS422",1000000,"RS422",1000000,"RS422",1000000,"RS422",1000000,"RS422",1000000,"RS422",1000000,"RS422",1000000,"RS422",1000000,"RS422",1000000,"RS422",1000000,"RS422",1000000,"RS422",1000000,"RS422",1000000,"RS422",1000000,"RS422",1000000,"RS422",1000000,"RS422",1000000,"RS422",1000000,"RS422",1000000,"RS422",1000000,"RS422",1000000,"RS422",1000000,"RS422",1000000,"RS422",1000000,"RS422",1000000,"RS422",1000000,"RS422",1000000,"RS422",1000000,"RS422",1000000,"RS422",1000000,"RS422",1000000,"RS422",1000000,"RS422",1000000,"RS422",1000000,"RS422",1000000,"RS422",1000000,"RS422",1000000,"RS422",1000000,"RS422",1000000,"RS422",1000000,"RS422",1000000,"RS422",1000000,"RS422",1000000,"RS422",1000000,"RS422",1000000,"RS422",1000000,"RS422",1000000,"RS422",1000000,"RS422",1000000,"RS422",1000000,"RS422",1000000,"RS422",1000000,"RS422",1000000,"RS422",1000000,"RS422",1000000,"RS422",1000000,"RS422",1000000,"RS422",1000000,"RS422",1000000,"RS422",1000000,"RS422",1000000,"RS422",1000000,"RS422",1000000,"RS422",1000000,"RS422",1000000,"RS422",1000000,"RS422",1000000,"RS422",1000000,"RS422",1000000,"RS422",1000000,"RS422",1000000,"RS422",1000000,"RS422",1000000,"RS422",1000000,"RS422",1000000,"RS422",1000000,"RS422",1000000,"RS422",1000000,"RS422",1000000,"RS422",1000000,"RS422",1000000,"RS422",1000000,"RS422",1000000,"RS422",1000000,"RS422",1000000,"RS422",1000000,"RS422",1000000,"RS422",1000000,"RS422",1000000,"RS422",1000000,"RS422",1000000,"RS422",1000000,"RS422",1000000,"RS422",1000000,"RS422",1000000,"RS422",1000000,"RS422",1000000,"RS422",1000000,"RS422",1000000,"RS422",1000000,"RS422",1000000,"RS422",1000000,"RS422",1000000,"RS422",1000000,"RS422",1000000,"RS422",1000000,"RS422",1000000,"RS422",1000000,"RS422",1000000,"RS422",1000000,"RS422",1000000,"RS422",1000000,"RS422",1000000,"RS422",1000000,"RS422",1000000,"RS422",1000000,"RS422",1000000,"RS422",1000000,"RS422",1000000,"RS422",1000000,"RS422",1000000,"RS422",1000000,"RS422",1000000,"RS422",1000000,"RS422",1000000,"RS422",1000000,"RS422",1000000,"RS422",1000000,"RS422",1000000,"RS422",1000000,"RS422",1000000,"RS422",1000000,"RS422",1000000,"RS422",1000000,"RS422",1000000,"RS422",1000000,"RS422",1000000,"RS422",1000000,"RS422",1000000,"RS422",1000000,"RS422",1000000,"RS422",1000000,"RS422",1000000,"RS422",1000000,"RS422",1000000,"RS422",1000000,"RS422",1000000,"RS422",1000000,"RS422",1000000,"RS422",1000000,"RS422",1000000,"RS422",1000000,"RS422",1000000,"RS422",1000000,"RS422",1000000,"RS422",1000000,"RS422",1000000,"RS422",1000000,"RS422",1000000,"RS422",1000000,"RS422",1000000,"RS422",1000000,"RS422",1000000,"RS422",1000000,"RS422",1000000,"RS422",1000000,"RS422",1000000,"RS422",1000000,"RS422",1000000,"RS422",1000000,"RS422",1000000,"RS422",1000000,"RS422",1000000,"RS422",1000000,"RS422",1000000,"RS422",1000000,"RS422",1000000,"RS422",1000000,"RS422",1000000,"RS422",1000000,"RS422",1000000,"RS422",1000000,"RS422",1000000,"RS422",1000000,"RS422",1000000,"RS422",1000000,"RS422",1000000,"RS422",1000000,"RS422",1000000,"RS422",1000000,"RS422",1000000,"RS422",1000000,"RS422",1000000,"RS422",1000000,"RS422",1000000,"RS422",1000000,"RS422",1000000,"RS422",1000000,"RS422",1000000,"RS422",1000000,"RS422",1000000,"RS422",1000000,"RS422",1000000,"RS422",1000000,"RS422",1000000,"RS422",1000000,"RS422",1000000,"RS422",1000000,"RS422",1000000,"RS422",1000000,"RS422",1000000,"RS422",1000000,"RS422",1000000,"RS422",1000000,"RS422",1000000,"RS422",1000000,"RS422",1000000,"RS422",1000000,"RS422",1000000,"RS422",1000000,"RS422",1000000,"RS422",1000000,"RS422",1000000,"RS422",1000000,"RS422",1000000,"RS422",1000000,"RS422",1000000,"RS422",1000000,"RS422",1000000,"RS422",1000000,"RS422",1000000,"RS422",1000000,"RS422",1000000,"RS422",1000000,"RS422",1000000,"RS422",1000000,"RS422",1000000,"RS422",1000000,"RS422",1000000,"RS422",1000000,"RS422",1000000,"RS422",1000000,"RS422",1000000,"RS422",1000000,"RS422",1000000,"RS422",1000000,"RS422",1000000,"RS422",1000000,"RS422",1000000,"RS422",1000000,"RS422",1000000,"RS422",1000000,"RS422",1000000,"RS422",1000000,"RS422",1000000,"RS422",1000000,"RS422",1000000,"RS422",1000000,"RS422",1000000,"RS422",1000000,"RS422",1000000,"RS422",1000000,"RS422",1000000,"RS422",1000000,"RS422",1000000,"RS422",1000000,"RS422",1000000,"RS422",1000000,"RS422",1000000,"RS422",1000000,"RS422",1000000,"RS422",1000000,"RS422",1000000,"RS422",1000000,"RS422",1000000,"RS422",1000000,"RS422",1000000,"RS422",1000000,"RS422",1000000,"RS422",1000000,"RS422",1000000,"RS422",1000000,"RS422",1000000,"RS422",1000000,"RS422",1000000,"RS422",1000000,"RS422",1000000,"RS422",1000000,"RS422",1000000,"RS422",1000000,"RS422",1000000,"RS422",1000000,"RS422",1000000,"RS422",1000000,"RS422",1000000,"RS422",1000000,"RS422",1000000,"RS422",1000000,"RS422",1000000,"RS422",1000000,"RS422",1000000,"RS422",1000000,"RS422",1000000,"RS422",1000000,"RS422",1000000,"RS422",1000000,"RS422",1000000,"RS422",1000000,"RS422",1000000,"RS422",1000000,"RS422",1000000,"RS422",1000000,"RS422",1000000,"RS422",1000000,"RS422",1000000,"RS422",1000000,"RS422",1000000,"RS422",1000000,"RS422",1000000,"RS422",1000000,"RS422",1000000,"RS422",1000000,"RS422",1000000,"RS422",1000000,"RS422",1000000,"RS422",1000000,"RS422",1000000,"RS422",1000000,"RS422",1000000,"RS422",1000000,"RS422",1000000,"RS422",1000000,"RS422",1000000,"RS422",1000000,"RS422",1000000,"RS422",1000000,"RS422",1000000,"RS422",1000000,"RS422",1000000,"RS422",1000000,"RS422",1000000,"RS422",1000000,"RS422",1000000,"RS422",1000000,"RS422",1000000,"RS422",1000000,"RS422",1000000,"RS422",1000000,"RS422",1000000,"RS422",1000000,"RS422",1000000,"RS422",1000000,"RS422",1000000,"RS422",1000000,"RS422",1000000,"RS422",1000000,"RS422",1000000,"RS422",1000000,"RS422",1000000,"RS422",1000000,"RS422",1000000,"RS422",1000000,"RS422",1000000,"RS422",1000000,"RS422",1000000,"RS422",1000000,"RS422",1000000,"RS422",1000000,"RS422",1000000,"RS422",1000000,"RS422",1000000,"RS422",1000000,"RS422",1000000,"RS422",1000000,"RS422",1000000,"RS422",1000000,"RS422",1000000,"RS422",1000000,"RS422",1000000,"RS422",1000000,"RS422",1000000,"RS422",1000000,"RS422",1000000,"RS422",1000000,"RS422",1000000,"RS422",1000000,"RS422",1000000,"RS422",1000000,"RS422",1000000,"RS422",1000000,"RS422",1000000,"RS422",1000000,"RS422",1000000,"RS422",1000000,"RS422",1000000,"RS422",1000000,"RS422",1000000,"RS422",1000000,"RS422",1000000,"RS422",1000000,"RS422",1000000,"RS422",1000000,"RS422",1000000,"RS422",1000000,"RS422",1000000,"RS422",1000000,"RS422",1000000,"RS422",1000000,"RS422",1000000,"RS422",1000000,"RS422",1000000,"RS422",1000000,"RS422",1000000,"RS422",1000000,"RS422",1000000,"RS422",1000000,"RS422",1000000,"RS422",1000000,"RS422",1000000,"RS422",1000000,"RS422",1000000,"RS422",1000000,"RS422",1000000,"RS422",1000000,"RS422",1000000,"RS422",1000000,"RS422",1000000,"RS422",1000000,"RS422",1000000,"RS422",1000000,"RS422",1000000,"RS422",1000000,"RS422",1000000,"RS422",1000000,"RS422",1000000,"RS422",1000000,"RS422",1000000,"RS422",1000000,"RS422",1000000,"RS422",1000000,"RS422",1000000,"RS422",1000000,"RS422",1000000,"RS422",1000000,"RS422",1000000,"RS422",1000000,"RS422",1000000,"RS422",1000000,"RS422",1000000,"RS422",1000000,"RS422",1000000,"RS422",1000000,"RS422",1000000,"RS422",1000000,"RS422",1000000,"RS422",1000000,"RS422",1000000,"RS422",1000000,"RS422",1000000,"RS422",1000000,"RS422",1000000,"RS422",1000000,"RS422",1000000,"RS422",1000000,"RS422",1000000,"RS422",1000000,"RS422",1000000,"RS422",1000000,"RS422",1000000,"RS422",1000000,"RS422",1000000,"RS422",1000000,"RS422",1000000,"RS422",1000000,"RS422",1000000,"RS422",1000000,"RS422",1000000,"RS422",1000000,"RS422",1000000,"RS422",1000000,"RS422",1000000,"RS422",1000000,"RS422",1000000,"RS422",1000000,"RS422",1000000,"RS422",1000000,"RS422",1000000,"RS422",1000000,"RS422",1000000,"RS422",1000000,"RS422",1000000,"RS422",1000000,"RS422",1000000,"RS422",1000000,"RS422",1000000,"RS422",1000000,"RS422",1000000,"RS422",1000000,"RS422",1000000,"RS422",1000000,"RS422",1000000,"RS422",1000000,"RS422",1000000,"RS422",1000000,"RS422",1000000,"RS422",1000000,"RS422",1000000,"RS422",1000000,"RS422",1000000,"RS422",1000000,"RS422",1000000,"RS422",1000000,"RS422",1000000,"RS422",1000000,"RS422",1000000,"RS422",1000000,"RS422",1000000,"RS422",1000000,"RS422",1000000,"RS422",1000000,"RS422",1000000,"RS422",1000000,"RS422",1000000,"RS422",1000000,"RS422",1000000,"RS422",1000000,"RS422",1000000,"RS422",1000000,"RS422",1000000,"RS422",1000000,"RS422",1000000,"RS422",1000000,"RS422",1000000,"RS422",1000000,"RS422",1000000,"RS422",1000000,"RS422",1000000,"RS422",1000000,"RS422",1000000,"RS422",1000000,"RS422",1000000,"RS422",1000000,"RS422",1000000,"RS422",1000000,"RS422",1000000,"RS422",1000000,"RS422",1000000,"RS422",1000000,"RS422",1000000,"RS422",1000000,"RS422",1000000,"RS422",1000000,"RS422",1000000,"RS422",1000000,"RS422",1000000,"RS422",1000000,"RS422",1000000,"RS422",1000000,"RS422",1000000,"RS422",1000000,"RS422",1000000,"RS422",1000000,"RS422",1000000,"RS422",1000000,"RS422",1000000,"RS422",1000000,"RS422",1000000,"RS422",1000000,"RS422",1000000,"RS422",1000000,"RS422",1000000,"RS422",1000000,"RS422",1000000,"RS422",1000000,"RS422",1000000,"RS422",1000000,"RS422",1000000,"RS422",1000000,"RS422",1000000,"RS422",1000000,"RS422",1000000,"RS422",1000000,"RS422",1000000,"RS422",1000000,"RS422",1000000,"RS422",1000000,"RS422",1000000,"RS422",1000000,"RS422",1000000,"RS422",1000000,"RS422",1000000,"RS422",1000000,"RS422",1000000,"RS422",1000000,"RS422",1000000,"RS422",1000000,"RS422",1000000,"RS422",1000000,"RS422",1000000,"RS422",1000000,"RS422",1000000,"RS422",1000000,"RS422",1000000,"RS422",1000000,"RS422",1000000,"RS422",1000000,"RS422",1000000,"RS422",1000000,"RS422",1000000,"RS422",1000000,"RS422",1000000,"RS422",1000000,"RS422",1000000,"RS422",1000000,"RS422",1000000,"RS422",1000000,"RS422",1000000,"RS422",1000000,"RS422",1000000,"RS422",1000000,"RS422",1000000,"RS422",1000000,"RS422",1000000,"RS422",1000000,"RS422",1000000,"RS422",1000000,"RS422",1000000,"RS422",1000000,"RS422",1000000,"RS422",1000000,"RS422",1000000,"RS422",1000000,"RS422",1000000,"RS422",1000000,"RS422",1000000,"RS422",1000000,"RS422",1000000,"RS422",1000000,"RS422",1000000,"RS422",1000000,"RS422",1000000,"RS422",1000000,"RS422",1000000,"RS422",1000000,"RS422",1000000,"RS422",1000000,"RS422",1000000,"RS422",1000000,"RS422",1000000,"RS422",1000000,"RS422",1000000,"RS422",1000000,"RS422",1000000,"RS422",1000000,"RS422",1000000,"RS422",1000000,"RS422",1000000,"RS422",1000000,"RS422",1000000,"RS422",1000000,"RS422",1000000,"RS422",1000000,"RS422",1000000,"RS422",1000000,"RS422",1000000,"RS422",1000000,"RS422",1000000,"RS422",1000000,"RS422",1000000,"RS422",1000000,"RS422",1000000,"RS422",1000000,"RS422",1000000,"RS422",1000000,"RS422",1000000,"RS422",1000000,"RS422",1000000,"RS422",1000000,"RS422",1000000,"RS422",1000000,"RS422",1000000,"RS422",1000000,"RS422",1000000,"RS422",1000000,"RS422",1000000,"RS422",1000000,"RS422",1000000,"RS422",1000000,"RS422",1000000,"RS422",1000000,"RS422",1000000,"RS422",1000000,"RS422",1000000,"RS422",1000000,"RS422",1000000,"RS422",1000000,"RS422",1000000,"RS422",1000000,"RS422",1000000,"RS422",1000000,"RS422",1000000,"RS422",1000000,"RS422",1000000,"RS422",1000000,"RS422",1000000,"RS422",1000000,"RS422",1000000,"RS422",1000000,"RS422",1000000,"RS422",1000000,"RS422",1000000,"RS422",1000000,"RS422",1000000,"RS422",1000000,"RS422",1000000,"RS422",1000000,"RS422",1000000,"RS422",1000000,"RS422",1000000,"RS422",1000000,"RS422",1000000,"RS422",1000000,"RS422",1000000,"RS422",1000000,"RS422",1000000,"RS422",1000000,"RS422",1000000,"RS422",1000000,"RS422",1000000,"RS422",1000000,"RS422",1000000,"RS422",1000000,"RS422",1000000,"RS422",1000000,"RS422",1000000,"RS422",1000000,"RS422",1000000,"RS422",1000000,"RS422",1000000,"RS422",1000000,"RS422",1000000,"RS422",1000000,"RS422",1000000,"RS422",1000000,"RS422",1000000,"RS422",1000000,"RS422",1000000,"RS422",1000000,"RS422",1000000,"RS422",1000000,"RS422",1000000,"RS422",1000000,"RS422",1000000,"RS422",1000000,"RS422",1000000,"RS422",1000000,"RS422",1000000,"RS422",1000000,"RS422",1000000,"RS422",1000000,"RS422",1000000,"RS422",1000000,"RS422",1000000,"RS422",1000000,"RS422",1000000,"RS422",1000000,"RS422",1000000,"RS422",1000000,"RS422",1000000,"RS422",1000000,"RS422",1000000,"RS422",1000000,"RS422",1000000,"RS422",1000000,"RS422",1000000,"RS422",1000000,"RS422",1000000,"RS422",1000000,"RS422",1000000,"RS422",1000000,"RS422",1000000,"RS422",1000000,"RS422",1000000,"RS422",1000000,"RS422",1000000,"RS422",1000000,"RS422",1000000,"RS422",1000000,"RS422",1000000,"RS422",1000000,"RS422",1000000,"RS422",1000000,"RS422",1000000,"RS422",1000000,"RS422",1000000,"RS422",1000000,"RS422",1000000,"RS422",1000000,"RS422",1000000,"RS422",1000000,"RS422",1000000,"RS422",1000000,"RS422",1000000,"RS422",1000000,"RS422",1000000,"RS422",1000000,"RS422",1000000,"RS422",1000000,"RS422",1000000,"RS422",1000000,"RS422",1000000,"RS422",1000000,"RS422",1000000,"RS422",1000000,"RS422",1000000,"RS422",1000000,"RS422",1000000,"RS422",1000000,"RS422",1000000,"RS422",1000000,"RS422",1000000,"RS422",1000000,"RS422",1000000,"RS422",1000000,"RS422",1000000,"RS422",1000000,"RS422",1000000,"RS422",1000000,"RS422",1000000,"RS422",1000000,"RS422",1000000,"RS422",1000000,"RS422",1000000,"RS422",1000000,"RS422",1000000,"RS422",1000000,"RS422",1000000,"RS422",1000000,"RS422",1000000,"RS422",1000000,"RS422",1000000,"RS422",1000000,"RS422",1000000,"RS422",1000000,"RS422",1000000,"RS422",1000000,"RS422",1000000,"RS422",1000000,"RS422",1000000,"RS422",1000000,"RS422",1000000,"RS422",1000000,"RS422",1000000,"RS422",1000000,"RS422",1000000,"RS422",1000000,"RS422",1000000,"RS422",1000000,"RS422",1000000,"RS422",1000000,"RS422",1000000,"RS422",1000000,"RS422",1000000,"RS422",1000000,"RS422",1000000,"RS422",1000000,"RS422",1000000,"RS422",1000000,"RS422",1000000,"RS422",1000000,"RS422",1000000,"RS422",1000000,"RS422",1000000,"RS422",1000000,"RS422",1000000,"RS422",1000000,"RS422",1000000,"RS422",1000000,"RS422",1000000,"RS422",1000000,"RS422",1000000,"RS422",1000000,"RS422",1000000,"RS422",1000000,"RS422",1000000,"RS422",1000000,"RS422",1000000,"RS422",1000000,"RS422",1000000,"RS422",1000000,"RS422",1000000,"RS422",1000000,"RS422",1000000,"RS422",1000000,"RS422",1000000,"RS422",1000000,"RS422",1000000,"RS422",1000000,"RS422",1000000,"RS422",1000000,"RS422",1000000,"RS422",1000000,"RS422",1000000,"RS422",1000000,"RS422",1000000,"RS422",1000000,"RS422",1000000,"RS422",1000000,"RS422",1000000,"RS422",1000000,"RS422",1000000,"RS422",1000000,"RS422",1000000,"RS422",1000000,"RS422",1000000,"RS422",1000000,"RS422",1000000,"RS422",1000000,"RS422",1000000,"RS422",1000000,"RS422",1000000,"RS422",1000000,"RS422",1000000,"RS422",1000000,"RS422",1000000,"RS422",1000000,"RS422",1000000,"RS422",1000000,"RS422",1000000,"RS422",1000000,"RS422",1000000,"RS422",1000000,"RS422",1000000,"RS422",1000000,"RS422",1000000,"RS422",1000000,"RS422",1000000,"RS422",1000000,"RS422",1000000,"RS422",1000000,"RS422",1000000,"RS422",1000000,"RS422",1000000,"RS422",1000000,"RS422",1000000,"RS422",1000000,"RS422",1000000,"RS422",1000000,"RS422",1000000,"RS422",1000000,"RS422",1000000,"RS422",1000000,"RS422",1000000,"RS422",1000000,"RS422",1000000,"RS422",1000000,"RS422",1000000,"RS422",1000000,"RS422",1000000,"RS422",1000000,"RS422",1000000,"RS422",1000000,"RS422",1000000,"RS422",1000000,"RS422",1000000,"RS422",1000000,"RS422",1000000,"RS422",1000000,"RS422",1000000,"RS422",1000000,"RS422",1000000,"RS422",1000000,"RS422",1000000,"RS422",1000000,"RS422",1000000,"RS422",1000000,"RS422",1000000,"RS422",1000000,"RS422",1000000,"RS422",1000000,"RS422",1000000,"RS422",1000000,"RS422",1000000,"RS422",1000000,"RS422",1000000,"RS422",1000000,"RS422",1000000,"RS422",1000000,"RS422",1000000,"RS422",1000000,"RS422",1000000,"RS422",1000000,"RS422",1000000,"RS422",1000000,"RS422",1000000,"RS422",1000000,"RS422",1000000,"RS422",1000000,"RS422",1000000,"RS422",1000000,"RS422",1000000,"RS422",1000000,"RS422",1000000,"RS422",1000000,"RS422",1000000,"RS422",1000000,"RS422",1000000,"RS422",1000000,"RS422",1000000,"RS422",1000000,"RS422",1000000,"RS422",1000000,"RS422",1000000,"RS422",1000000,"RS422",1000000,"RS422",1000000,"RS422",1000000,"RS422",1000000,"RS422",1000000,"RS422",1000000,"RS422",1000000,"RS422",1000000,"RS422",1000000,"RS422",1000000,"RS422",1000000,"RS422",1000000,"RS422",1000000,"RS422",1000000,"RS422",1000000,"RS422",1000000,"RS422",1000000,"RS422",1000000,"RS422",1000000,"RS422",1000000,"RS422",1000000,"RS422",1000000,"RS422",1000000,"RS422",1000000,"RS422",1000000,"RS422",1000000,"RS422",1000000,"RS422",1000000,"RS422",1000000,"RS422",1000000,"RS422",1000000,"RS422",1000000,"RS422",1000000,"RS422",1000000,"RS422",1000000,"RS422",1000000,"RS422",1000000,"RS422",1000000,"RS422",1000000,"RS422",1000000,"RS422",1000000,"RS422",1000000,"RS422",1000000,"RS422",1000000,"RS422",1000000,"RS422",1000000,"RS422",1000000,"RS422",1000000,"RS422",1000000,"RS422",1000000,"RS422",1000000,"RS422",1000000,"RS422",1000000,"RS422",1000000,"RS422",1000000,"RS422",1000000,"RS422",1000000,"RS422",1000000,"RS422",1000000,"RS422",1000000,"RS422",1000000,"RS422",1000000,"RS422",1000000,"RS422",1000000,"RS422",1000000,"RS422",1000000,"RS422",1000000,"RS422",1000000,"RS422",1000000,"RS422",1000000,"RS422",1000000,"RS422",1000000,"RS422",1000000,"RS422",1000000,"RS422",1000000,"RS422",1000000,"RS422",1000000,"RS422",1000000,"RS422",1000000,"RS422",1000000,"RS422",1000000,"RS422",1000000,"RS422",1000000,"RS422",1000000,"RS422",1000000,"RS422",1000000,"RS422",1000000,"RS422",1000000,"RS422",1000000,"RS422",1000000,"RS422",1000000,"RS422",1000000,"RS422",1000000,"RS422",1000000,"RS422",1000000,"RS422",1000000,"RS422",1000000,"RS422",1000000,"RS422",1000000,"RS422",1000000,"RS422",1000000,"RS422",1000000,"RS422",1000000,"RS422",1000000,"RS422",1000000,"RS422",1000000,"RS422",1000000,"RS422",1000000,"RS422",1000000,"RS422",1000000,"RS422",1000000,"RS422",1000000,"RS422",1000000,"RS422",1000000,"RS422",1000000,"RS422",1000000,"RS422",1000000,"RS422",1000000,"RS422",1000000,"RS422",1000000,"RS422",1000000,"RS422",1000000,"RS422",1000000,"RS422",1000000,"RS422",1000000,"RS422",1000000,"RS422",1000000,"RS422",1000000,"RS422",1000000,"RS422",1000000,"RS422",1000000,"RS422",1000000,"RS422",1000000,"RS422",1000000,"RS422",1000000,"RS422",1000000,"RS422",1000000,"RS422",1000000,"RS422",1000000,"RS422",1000000,"RS422",1000000,"RS422",1000000,"RS422",1000000,"RS422",1000000,"RS422",1000000,"RS422",1000000,"RS422",1000000,"RS422",1000000,"RS422",1000000,"RS422",1000000,"RS422",1000000,"RS422",1000000,"RS422",1000000,"RS422",1000000,"RS422",1000000,"RS422",1000000,"RS422",1000000,"RS422",1000000,"RS422",1000000,"RS422",1000000,"RS422",1000000,"RS422",1000000,"RS422",1000000,"RS422",1000000,"RS422",1000000,"RS422",1000000,"RS422",1000000,"RS422",1000000,"RS422",1000000,"RS422",1000000,"RS422",1000000,"RS422",1000000,"RS422",1000000,"RS422",1000000,"RS422",1000000,"RS422",1000000,"RS422",1000000,"RS422",1000000,"RS422",1000000,"RS422",1000000,"RS422",1000000,"RS422",1000000,"RS422",1000000,"RS422",1000000,"RS422",1000000,"RS422",1000000,"RS422",1000000,"RS422",1000000,"RS422",1000000,"RS422",1000000,"RS422",1000000,"RS422",1000000,"RS422",1000000,"RS422",1000000,"RS422",1000000,"RS422",1000000,"RS422",1000000,"RS422",1000000,"RS422",1000000,"RS422",1000000,"RS422",1000000,"RS422",1000000,"RS422",1000000,"RS422",1000000,"RS422",1000000,"RS422",1000000,"RS422",1000000,"RS422",1000000,"RS422",1000000,"RS422",1000000,"RS422",1000000,"RS422",1000000,"RS422",1000000,"RS422",1000000,"RS422",1000000,"RS422",1000000,"RS422",1000000,"RS422",1000000,"RS422",1000000,"RS422",1000000,"RS422",1000000,"RS422",1000000,"RS422",1000000,"RS422",1000000,"RS422",1000000,"RS422",1000000,"RS422",1000000,"RS422",1000000,"RS422",1000000,"RS422",1000000,"RS422",1000000,"RS422",1000000,"RS422",1000000,"RS422",1000000,"RS422",1000000,"RS422",1000000,"RS422",1000000,"RS422",1000000,"RS422",1000000,"RS422",1000000,"RS422",1000000,"RS422",1000000,"RS422",1000000,"RS422",1000000,"RS422",1000000,"RS422",1000000,"RS422",1000000,"RS422",1000000,"RS422",1000000,"RS422",1000000,"RS422",1000000,"RS422",1000000,"RS422",1000000,"RS422",1000000,"RS422",1000000,"RS422",1000000,"RS422",1000000,"RS422",1000000,"RS422",1000000,"RS422",1000000,"RS422",1000000,"RS422",1000000,"RS422",1000000,"RS422",1000000,"RS422",1000000,"RS422",1000000,"RS422",1000000,"RS422",1000000,"RS422",1000000,"RS422",1000000,"RS422",1000000,"RS422",1000000,"RS422",1000000,"RS422",1000000,"RS422",1000000,"RS422",1000000,"RS422",1000000,"RS422",1000000,"RS422",1000000,"RS422",1000000,"RS422",1000000,"RS422",1000000,"RS422",1000000,"RS422",1000000,"RS422",1000000,"RS422",1000000,"RS422",1000000,"RS422",1000000,"RS422",1000000,"RS422",1000000,"RS422",1000000,"RS422",1000000,"RS422",1000000,"RS422",1000000,"RS422",1000000,"RS422",1000000,"RS422",1000000,"RS422",1000000,"RS422",1000000,"RS422",1000000,"RS422",1000000,"RS422",1000000,"RS422",1000000,"RS422",1000000,"RS422",1000000,"RS422",1000000,"RS422",1000000,"RS422",1000000,"RS422",1000000,"RS422",1000000,"RS422",1000000,"RS422",1000000,"RS422",1000000,"RS422",1000000,"RS422",1000000,"RS422",1000000,"RS422",1000000,"RS422",1000000,"RS422",1000000,"RS422",1000000,"RS422",1000000,"RS422",1000000,"RS422",1000000,"RS422",1000000,"RS422",1000000,"RS422",1000000,"RS422",1000000,"RS422",1000000,"RS422",1000000,"RS422",1000000,"RS422",1000000,"RS422",1000000,"RS422",1000000,"RS422",1000000,"RS422",1000000,"RS422",1000000,"RS422",1000000,"RS422",1000000,"RS422",1000000,"RS422",1000000,"RS422",1000000,"RS422",1000000,"RS422",1000000,"RS422",1000000,"RS422",1000000,"RS422",1000000,"RS422",1000000,"RS422",1000000,"RS422",1000000,"RS422",1000000,"RS422",1000000,"RS422",1000000,"RS422",1000000,"RS422",1000000,"RS422",1000000,"RS422",1000000,"RS422",1000000,"RS422",1000000,"RS422",1000000,"RS422",1000000,"RS422",1000000,"RS422",1000000,"RS422",1000000,"RS422",1000000,"RS422",1000000,"RS422",1000000,"RS422",1000000,"RS422",1000000,"RS422",1000000,"RS422",1000000,"RS422",1000000,"RS422",1000000,"RS422",1000000,"RS422",1000000,"RS422",1000000,"RS422",1000000,"RS422",1000000,"RS422",1000000,"RS422",1000000,"RS422",1000000,"RS422",1000000,"RS422",1000000,"RS422",1000000,"RS422",1000000,"RS422",1000000,"RS422",1000000,"RS422",1000000,"RS422",1000000,"RS422",1000000,"RS422",1000000,"RS422",1000000,"RS422",1000000,"RS422",1000000,"RS422",1000000,"RS422",1000000,"RS422",1000000,"RS422",1000000,"RS422",1000000,"RS422",1000000,"RS422",1000000,"RS422",1000000,"RS422",1000000,"RS422",1000000,"RS422",1000000,"RS422",1000000,"RS422",1000000,"RS422",1000000,"RS422",1000000,"RS422",1000000,"RS422",1000000,"RS422",1000000,"RS422",1000000,"RS422",1000000,"RS422",1000000,"RS422",1000000,"RS422",1000000,"RS422",1000000,"RS422",1000000,"RS422",1000000,"RS422",1000000,"RS422",1000000,"RS422",1000000,"RS422",1000000,"RS422",1000000,"RS422",1000000,"RS422",1000000,"RS422",1000000,"RS422",1000000,"RS422",1000000,"RS422",1000000,"RS422",1000000,"RS422",1000000,"RS422",1000000,"RS422",1000000,"RS422",1000000,"RS422",1000000,"RS422",1000000,"RS422",1000000,"RS422",1000000,"RS422",1000000,"RS422",1000000,"RS422",1000000,"RS422",1000000,"RS422",1000000,"RS422",1000000,"RS422",1000000,"RS422",1000000,"RS422",1000000,"RS422",1000000,"RS422",1000000,"RS422",1000000,"RS422",1000000,"RS422",1000000,"RS422",1000000,"RS422",1000000,"RS422",1000000,"RS422",1000000,"RS422",1000000,"RS422",1000000,"RS422",1000000,"RS422",1000000,"RS422",1000000,"RS422",1000000,"RS422",1000000,"RS422",1000000,"RS422",1000000,"RS422",1000000,"RS422",1000000,"RS422",1000000,"RS422",1000000,"RS422",1000000,"RS422",1000000,"RS422",1000000,"RS422",1000000,"RS422",1000000,"RS422",1000000,"RS422",1000000,"RS422",1000000,"RS422",1000000,"RS422",1000000,"RS422",1000000,"RS422",1000000,"RS422",1000000,"RS422",1000000,"RS422",1000000,"RS422",1000000,"RS422",1000000,"RS422",1000000,"RS422",1000000,"RS422",1000000,"RS422",1000000,"RS422",1000000,"RS422",1000000,"RS422",1000000,"RS422",1000000,"RS422",1000000,"RS422",1000000,"RS422",1000000,"RS422",1000000,"RS422",1000000,"RS422",1000000,"RS422",1000000,"RS422",1000000,"RS422",1000000,"RS422",1000000,"RS422",1000000,"RS422",1000000,"RS422",1000000,"RS422",1000000,"RS422",1000000,"RS422",1000000,"RS422",1000000,"RS422",1000000,"RS422",1000000,"RS422",1000000,"RS422",1000000,"RS422",1000000,"RS422",1000000,"RS422",1000000,"RS422",1000000,"RS422",1000000,"RS422",1000000,"RS422",1000000,"RS422",1000000,"RS422",1000000,"RS422",1000000,"RS422",1000000,"RS422",1000000,"RS422",1000000,"RS422",1000000,"RS422",1000000,"RS422",1000000,"RS422",1000000,"RS422",1000000,"RS422",1000000,"RS422",1000000,"RS422",1000000,"RS422",1000000,"RS422",1000000,"RS422",1000000,"RS422",1000000,"RS422",1000000,"RS422",1000000,"RS422",1000000,"RS422",1000000,"RS422",1000000,"RS422",1000000,"RS422",1000000,"RS422",1000000,"RS422",1000000,"RS422",1000000,"RS422",1000000,"RS422",1000000,"RS422",1000000,"RS422",1000000,"RS422",1000000,"RS422",1000000,"RS422",1000000,"RS422",1000000,"RS422",1000000,"RS422",1000000,"RS422",1000000,"RS422",1000000,"RS422",1000000,"RS422",1000000,"RS422",1000000,"RS422",1000000,"RS422",1000000,"RS422",1000000,"RS422",1000000,"RS422",1000000,"RS422",1000000,"RS422",1000000,"RS422",1000000,"RS422",1000000,"RS422",1000000,"RS422",1000000,"RS422",1000000,"RS422",1000000,"RS422",1000000,"RS422",1000000,"RS422",1000000,"RS422",1000000,"RS422",1000000,"RS422",1000000,"RS422",1000000,"RS422",1000000,"RS422",1000000,"RS422",1000000,"RS422",1000000,"RS422",1000000,"RS422",1000000,"RS422",1000000,"RS422",1000000,"RS422",1000000,"RS422",1000000,"RS422",1000000,"RS422",1000000,"RS422",1000000,"RS422",1000000,"RS422",1000000,"RS422",1000000,"RS422",1000000,"RS422",1000000,"RS422",1000000,"RS422",1000000,"RS422",1000000,"RS422",1000000,"RS422",1000000,"RS422",1000000,"RS422",1000000,"RS422",1000000,"RS422",1000000,"RS422",1000000,"RS422",1000000,"RS422",1000000,"RS422",1000000,"RS422",1000000,"RS422",1000000,"RS422",1000000,"RS422",1000000,"RS422",1000000,"RS422",1000000,"RS422",1000000,"RS422",1000000,"RS422",1000000,"RS422",1000000,"RS422",1000000,"RS422",1000000,"RS422",1000000,"RS422",1000000,"RS422",1000000,"RS422",1000000,"RS422",1000000,"RS422",1000000,"RS422",1000000,"RS422",1000000,"RS422",1000000,"RS422",1000000,"RS422",1000000,"RS422",1000000,"RS422",1000000,"RS422",1000000,"RS422",1000000,"RS422",1000000,"RS422",1000000,"RS422",1000000,"RS422",1000000,"RS422",1000000,"RS422",1000000,"RS422",1000000,"RS422",1000000,"RS422",1000000,"RS422",1000000,"RS422",1000000,"RS422",1000000,"RS422",1000000,"RS422",1000000,"RS422",1000000,"RS422",1000000,"RS422",1000000,"RS422",1000000,"RS422",1000000,"RS422",1000000,"RS422",1000000,"RS422",1000000,"RS422",1000000,"RS422",1000000,"RS422",1000000,"RS422",1000000,"RS422",1000000,"RS422",1000000,"RS422",1000000,"RS422",1000000,"RS422",1000000,"RS422",1000000,"RS422",1000000,"RS422",1000000,"RS422",1000000,"RS422",1000000,"RS422",1000000,"RS422",1000000,"RS422",1000000,"RS422",1000000,"RS422",1000000,"RS422",1000000,"RS422",1000000,"RS422",1000000,"RS422",1000000,"RS422",1000000,"RS422",1000000,"RS422",1000000,"RS422",1000000,"RS422",1000000,"RS422",1000000,"RS422",1000000,"RS422",1000000,"RS422",1000000,"RS422",1000000,"RS422",1000000,"RS422",1000000,"RS422",1000000,"RS422",1000000,"RS422",1000000,"RS422",1000000,"RS422",1000000,"RS422",1000000,"RS422",1000000,"RS422",1000000,"RS422",1000000,"RS422",1000000,"RS422",1000000,"RS422",1000000,"RS422",1000000,"RS422",1000000,"RS422",1000000,"RS422",1000000,"RS422",1000000,"RS422",1000000,"RS422",1000000,"RS422",1000000,"RS422",1000000,"RS422",1000000,"RS422",1000000,"RS422",1000000,"RS422",1000000,"RS422",1000000,"RS422",1000000,"RS422",1000000,"RS422",1000000,"RS422",1000000,"RS422",1000000,"RS422",1000000,"RS422",1000000,"RS422",1000000,"RS422",1000000,"RS422",1000000,"RS422",1000000,"RS422",1000000,"RS422",1000000,"RS422",1000000,"RS422",1000000,"RS422",1000000,"RS422",1000000,"RS422",1000000,"RS422",1000000,"RS422",1000000,"RS422",1000000,"RS422",1000000,"RS422",1000000,"RS422",1000000,"RS422",1000000,"RS422",1000000,"RS422",1000000,"RS422",1000000,"RS422",1000000,"RS422",1000000,"RS422",1000000,"RS422",1000000,"RS422",1000000,"RS422",1000000,"RS422",1000000,"RS422",1000000,"RS422",1000000,"RS422",1000000,"RS422",1000000,"RS422",1000000,"RS422",1000000,"RS422",1000000,"RS422",1000000,"RS422",1000000,"RS422",1000000,"RS422",1000000,"RS422",1000000,"RS422",1000000,"RS422",1000000,"RS422",1000000,"RS422",1000000,"RS422",1000000,"RS422",1000000,"RS422",1000000,"RS422",1000000,"RS422",1000000,"RS422",1000000,"RS422",1000000,"RS422",1000000,"RS422",1000000,"RS422",1000000,"RS422",1000000,"RS422",1000000,"RS422",1000000,"RS422",1000000,"RS422",1000000,"RS422",1000000,"RS422",1000000,"RS422",1000000,"RS422",1000000,"RS422",1000000,"RS422",1000000,"RS422",1000000,"RS422",1000000,"RS422",1000000,"RS422",1000000,"RS422",1000000,"RS422",1000000,"RS422",1000000,"RS422",1000000,"RS422",1000000,"RS422",1000000,"RS422",1000000,"RS422",1000000,"RS422",1000000,"RS422",1000000,"RS422",1000000,"RS422",1000000,"RS422",1000000,"RS422",1000000,"RS422",1000000,"RS422",1000000,"RS422",1000000,"RS422",1000000,"RS422",1000000,"RS422",1000000,"RS422",1000000,"RS422",1000000,"RS422",1000000,"RS422",1000000,"RS422",1000000,"RS422",1000000,"RS422",1000000,"RS422",1000000,"RS422",1000000,"RS422",1000000,"RS422",1000000,"RS422",1000000,"RS422",1000000,"RS422",1000000,"RS422",1000000,"RS422",1000000,"RS422",1000000,"RS422",1000000,"RS422",1000000,"RS422",1000000,"RS422",1000000,"RS422",1000000,"RS422",1000000,"RS422",1000000,"RS422",1000000,"RS422",1000000,"RS422",1000000,"RS422",1000000,"RS422",1000000,"RS422",1000000,"RS422",1000000,"RS422",1000000,"RS422",1000000,"RS422",1000000,"RS422",1000000,"RS422",1000000,"RS422",1000000,"RS422",1000000,"RS422",1000000,"RS422",1000000,"RS422",1000000,"RS422",1000000,"RS422",1000000,"RS422",1000000,"RS422",1000000,"RS422",1000000,"RS422",1000000,"RS422",1000000,"RS422",1000000,"RS422",1000000,"RS422",1000000,"RS422",1000000,"RS422",1000000,"RS422",1000000,"RS422",1000000,"RS422",1000000,"RS422",1000000,"RS422",1000000,"RS422",1000000,"RS422",1000000,"RS422",1000000,"RS422",1000000,"RS422",1000000,"RS422",1000000,"RS422",1000000,"RS422",1000000,"RS422",1000000,"RS422",1000000,"RS422",1000000,"RS422",1000000,"RS422",1000000,"RS422",1000000,"RS422",1000000,"RS422",1000000,"RS422",1000000,"RS422",1000000,"RS422",1000000,"RS422",1000000,"RS422",1000000,"RS422",1000000,"RS422",1000000,"RS422",1000000,"RS422",1000000,"RS422",1000000,"RS422",1000000,"RS422",1000000,"RS422",1000000,"RS422",1000000,"RS422",1000000,"RS422",1000000,"RS422",1000000,"RS422",1000000,"RS422",1000000,"RS422",1000000,"RS422",1000000,"RS422",1000000,"RS422",1000000,"RS422",1000000,"RS422",1000000,"RS422",1000000,"RS422",1000000,"RS422",1000000,"RS422",1000000,"RS422",1000000,"RS422",1000000,"RS422",1000000,"RS422",1000000,"RS422",1000000,"RS422",1000000,"RS422",1000000,"RS422",1000000,"RS422",1000000,"RS422",1000000,"RS422",1000000,"RS422",1000000,"RS422",1000000,"RS422",1000000,"RS422",1000000,"RS422",1000000,"RS422",1000000,"RS422",1000000,"RS422",1000000,"RS422",1000000,"RS422",1000000,"RS422",1000000,"RS422",1000000,"RS422",1000000,"RS422",1000000,"RS422",1000000,"RS422",1000000,"RS422",1000000,"RS422",1000000,"RS422",1000000,"RS422",1000000,"RS422",1000000,"RS422",1000000,"RS422",1000000,"RS422",1000000,"RS422",1000000,"RS422",1000000,"RS422",1000000,"RS422",1000000,"RS422",1000000,"RS422",1000000,"RS422",1000000,"RS422",1000000,"RS422",1000000,"RS422",1000000,"RS422",1000000,"RS422",1000000,"RS422",1000000,"RS422",1000000,"RS422",1000000,"RS422",1000000,"RS422",1000000,"RS422",1000000,"RS422",1000000,"RS422",1000000,"RS422",1000000,"RS422",1000000,"RS422",1000000,"RS422",1000000,"RS422",1000000,"RS422",1000000,"RS422",1000000,"RS422",1000000,"RS422",1000000,"RS422",1000000,"RS422",1000000,"RS422",1000000,"RS422",1000000,"RS422",1000000,"RS422",1000000,"RS422",1000000,"RS422",1000000,"RS422",1000000,"RS422",1000000,"RS422",1000000,"RS422",1000000,"RS422",1000000,"RS422",1000000,"RS422",1000000,"RS422",1000000,"RS422",1000000,"RS422",1000000,"RS422",1000000,"RS422",1000000,"RS422",1000000,"RS422",1000000,"RS422",1000000,"RS422",1000000,"RS422",1000000,"RS422",1000000,"RS422",1000000,"RS422",1000000,"RS422",1000000,"RS422",1000000,"RS422",1000000,"RS422",1000000,"RS422",1000000,"RS422",1000000,"RS422",1000000,"RS422",1000000,"RS422",1000000,"RS422",1000000,"RS422",1000000,"RS422",1000000,"RS422",1000000,"RS422",1000000,"RS422",1000000,"RS422",1000000,"RS422",1000000,"RS422",1000000,"RS422",1000000,"RS422",1000000,"RS422",1000000,"RS422",1000000,"RS422",1000000,"RS422",1000000,"RS422",1000000,"RS422",1000000,"RS422",1000000,"RS422",1000000,"RS422",1000000,"RS422",1000000,"RS422",1000000,"RS422",1000000,"RS422",1000000,"RS422",1000000,"RS422",1000000,"RS422",1000000,"RS422",1000000,"RS422",1000000,"RS422",1000000,"RS422",1000000,"RS422",1000000,"RS422",1000000,"RS422",1000000,"RS422",1000000,"RS422",1000000,"RS422",1000000,"RS422",1000000,"RS422",1000000,"RS422",1000000,"RS422",1000000,"RS422",1000000,"RS422",1000000,"RS422",1000000,"RS422",1000000,"RS422",1000000,"RS422",1000000,"RS422",1000000,"RS422",1000000,"RS422",1000000,"RS422",1000000,"RS422",1000000,"RS422",1000000,"RS422",1000000,"RS422",1000000,"RS422",1000000,"RS422",1000000,"RS422",1000000,"RS422",1000000,"RS422",1000000,"RS422",1000000,"RS422",1000000,"RS422",1000000,"RS422",1000000,"RS422",1000000,"RS422",1000000,"RS422",1000000,"RS422",1000000,"RS422",1000000,"RS422",1000000,"RS422",1000000,"RS422",1000000,"RS422",1000000,"RS422",1000000,"RS422",1000000,"RS422",1000000,"RS422",1000000,"RS422",1000000,"RS422",1000000,"RS422",1000000,"RS422",1000000,"RS422",1000000,"RS422",1000000,"RS422",1000000,"RS422",1000000,"RS422",1000000,"RS422",1000000,"RS422",1000000,"RS422",1000000,"RS422",1000000,"RS422",1000000,"RS422",1000000,"RS422",1000000,"RS422",1000000,"RS422",1000000,"RS422",1000000,"RS422",1000000,"RS422",1000000,"RS422",1000000,"RS422",1000000,"RS422",1000000,"RS422",1000000,"RS422",1000000,"RS422",1000000,"RS422",1000000,"RS422",1000000,"RS422",1000000,"RS422",1000000,"RS422",1000000,"RS422",1000000,"RS422",1000000,"RS422",1000000,"RS422",1000000,"RS422",1000000,"RS422",1000000,"RS422",1000000,"RS422",1000000,"RS422",1000000,"RS422",1000000,"RS422",1000000,"RS422",1000000,"RS422",1000000,"RS422",1000000,"RS422",1000000,"RS422",1000000,"RS422",1000000,"RS422",1000000,"RS422",1000000,"RS422",1000000,"RS422",1000000,"RS422",1000000,"RS422",1000000,"RS422",1000000,"RS422",1000000,"RS422",1000000,"RS422",1000000,"RS422",1000000,"RS422",1000000,"RS422",1000000,"RS422",1000000,"RS422",1000000,"RS422",1000000,"RS422",1000000,"RS422",1000000,"RS422",1000000,"RS422",1000000,"RS422",1000000,"RS422",1000000,"RS422",1000000,"RS422",1000000,"RS422",1000000,"RS422",1000000,"RS422",1000000,"RS422",1000000,"RS422",1000000,"RS422",1000000,"RS422",1000000,"RS422",1000000,"RS422",1000000,"RS422",1000000,"RS422",1000000,"RS422",1000000,"RS422",1000000,"RS422",1000000,"RS422",1000000,"RS422",1000000,"RS422",1000000,"RS422",1000000,"RS422",1000000,"RS422",1000000,"RS422",1000000,"RS422",1000000,"RS422",1000000,"RS422",1000000,"RS422",1000000,"RS422",1000000,"RS422",1000000,"RS422",1000000,"RS422",1000000,"RS422",1000000,"RS422",1000000,"RS422",1000000,"RS422",1000000,"RS422",1000000,"RS422",1000000,"RS422",1000000,"RS422",1000000,"RS422",1000000,"RS422",1000000,"RS422",1000000,"RS422",1000000,"RS422",1000000,"RS422",1000000,"RS422",1000000,"RS422",1000000,"RS422",1000000,"RS422",1000000,"RS422",1000000,"RS422",1000000,"RS422",1000000,"RS422",1000000,"RS422",1000000,"RS422",1000000,"RS422",1000000,"RS422",1000000,"RS422",1000000,"RS422",1000000,"RS422",1000000,"RS422",1000000,"RS422",1000000,"RS422",1000000,"RS422",1000000,"RS422",1000000,"RS422",1000000,"RS422",1000000,"RS422",1000000,"RS422",1000000,"RS422",1000000,"RS422",1000000,"RS422",1000000,"RS422",1000000,"RS422",1000000,"RS422",1000000,"RS422",1000000,"RS422",1000000,"RS422",1000000,"RS422",1000000,"RS422",1000000,"RS422",1000000,"RS422",1000000,"RS422",1000000,"RS422",1000000,"RS422",1000000,"RS422",1000000,"RS422",1000000,"RS422",1000000,"RS422",1000000,"RS422",1000000,"RS422",1000000,"RS422",1000000,"RS422",1000000,"RS422",1000000,"RS422",1000000,"RS422",1000000,"RS422",1000000,"RS422",1000000,"RS422",1000000,"RS422",1000000,"RS422",1000000,"RS422",1000000,"RS422",1000000,"RS422",1000000,"RS422",1000000,"RS422",1000000,"RS422",1000000,"RS422",1000000,"RS422",1000000,"RS422",1000000,"RS422",1000000,"RS422",1000000,"RS422",1000000,"RS422",1000000,"RS422",1000000,"RS422",1000000,"RS422",1000000,"RS422",1000000,"RS422",1000000,"RS422",1000000,"RS422",1000000,"RS422",1000000,"RS422",1000000,"RS422",1000000,"RS422",1000000,"RS422",1000000,"RS422",1000000,"RS422",1000000,"RS422",1000000,"RS422",1000000,"RS422",1000000,"RS422",1000000,"RS422",1000000,"RS422",1000000,"RS422",1000000,"RS422",1000000,"RS422",1000000,"RS422",1000000,"RS422",1000000,"RS422",1000000,"RS422",1000000,"RS422",1000000,"RS422",1000000,"RS422",1000000,"RS422",1000000,"RS422",1000000,"RS422",1000000,"RS422",1000000,"RS422",1000000,"RS422",1000000,"RS422",1000000,"RS422",1000000,"RS422",1000000,"RS422",1000000,"RS422",1000000,"RS422",1000000,"RS422",1000000,"RS422",1000000,"RS422",1000000,"RS422",1000000,"RS422",1000000,"RS422",1000000,"RS422",1000000,"RS422",1000000,"RS422",1000000,"RS422",1000000,"RS422",1000000,"RS422",1000000,"RS422",1000000,"RS422",1000000,"RS422",1000000,"RS422",1000000,"RS422",1000000,"RS422",1000000,"RS422",1000000,"RS422",1000000,"RS422",1000000,"RS422",1000000,"RS422",1000000,"RS422",1000000,"RS422",1000000,"RS422",1000000,"RS422",1000000,"RS422",1000000,"RS422",1000000,"RS422",1000000,"RS422",1000000,"RS422",1000000,"RS422",1000000,"RS422",1000000,"RS422",1000000,"RS422",1000000,"RS422",1000000,"RS422",1000000,"RS422",1000000,"RS422",1000000,"RS422",1000000,"RS422",1000000,"RS422",1000000,"RS422",1000000,"RS422",1000000,"RS422",1000000,"RS422",1000000,"RS422",1000000,"RS422",1000000,"RS422",1000000,"RS422",1000000,"RS422",1000000,"RS422",1000000,"RS422",1000000,"RS422",1000000,"RS422",1000000,"RS422",1000000,"RS422",1000000,"RS422",1000000,"RS422",1000000,"RS422",1000000,"RS422",1000000,"RS422",1000000,"RS422",1000000,"RS422",1000000,"RS422",1000000,"RS422",1000000,"RS422",1000000,"RS422",1000000,"RS422",1000000,"RS422",1000000,"RS422",1000000,"RS422",1000000,"RS422",1000000,"RS422",1000000,"RS422",1000000,"RS422",1000000,"RS422",1000000,"RS422",1000000,"RS422",1000000,"RS422",1000000,"RS422",1000000,"RS422",1000000,"RS422",1000000,"RS422",1000000,"RS422",1000000,"RS422",1000000,"RS422",1000000,"RS422",1000000,"RS422",1000000,"RS422",1000000,"RS422",1000000,"RS422",1000000,"RS422",1000000,"RS422",1000000,"RS422",1000000,"RS422",1000000,"RS422",1000000,"RS422",1000000,"RS422",1000000,"RS422",1000000,"RS422",1000000,"RS422",1000000,"RS422",1000000,"RS422",1000000,"RS422",1000000,"RS422",1000000,"RS422",1000000,"RS422",1000000,"RS422",1000000,"RS422",1000000,"RS422",1000000,"RS422",1000000,"RS422",1000000,"RS422",1000000,"RS422",1000000,"RS422",1000000,"RS422",1000000,"RS422",1000000,"RS422",1000000,"RS422",1000000,"RS422",1000000,"RS422",1000000,"RS422",1000000,"RS422",1000000,"RS422",1000000,"RS422",1000000,"RS422",1000000,"RS422",1000000,"RS422",1000000,"RS422",1000000,"RS422",1000000,"RS422",1000000,"RS422",1000000,"RS422",1000000,"RS422",1000000,"RS422",1000000,"RS422",1000000,"RS422",1000000,"RS422",1000000,"RS422",1000000,"RS422",1000000,"RS422",1000000,"RS422",1000000,"RS422",1000000,"RS422",1000000,"RS422",1000000,"RS422",1000000,"RS422",1000000,"RS422",1000000,"RS422",1000000,"RS422",1000000,"RS422",1000000,"RS422",1000000,"RS422",1000000,"RS422",1000000,"RS422",1000000,"RS422",1000000,"RS422",1000000,"RS422",1000000,"RS422",1000000,"RS422",1000000,"RS422",1000000,"RS422",1000000,"RS422",1000000,"RS422",1000000,"RS422",1000000,"RS422",1000000,"RS422",1000000,"RS422",1000000,"RS422",1000000,"RS422",1000000,"RS422",1000000,"RS422",1000000,"RS422",1000000,"RS422",1000000,"RS422",1000000,"RS422",1000000,"RS422",1000000,"RS422",1000000,"RS422",1000000,"RS422",1000000,"RS422",1000000,"RS422",1000000,"RS422",1000000,"RS422",1000000,"RS422",1000000,"RS422",1000000,"RS422",1000000,"RS422",1000000,"RS422",1000000,"RS422",1000000,"RS422",1000000,"RS422",1000000,"RS422",1000000,"RS422",1000000,"RS422",1000000,"RS422",1000000,"RS422",1000000,"RS422",1000000,"RS422",1000000,"RS422",1000000,"RS422",1000000,"RS422",1000000,"RS422",1000000,"RS422",1000000,"RS422",1000000,"RS422",1000000,"RS422",1000000,"RS422",1000000,"RS422",1000000,"RS422",1000000,"RS422",1000000,"RS422",1000000,"RS422",1000000,"RS422",1000000,"RS422",1000000,"RS422",1000000,"RS422",1000000,"RS422",1000000,"RS422",1000000,"RS422",1000000,"RS422",1000000,"RS422",1000000,"RS422",1000000,"RS422",1000000,"RS422",1000000,"RS422",1000000,"RS422",1000000,"RS422",1000000,"RS422",1000000,"RS422",1000000,"RS422",1000000,"RS422",1000000,"RS422",1000000,"RS422",1000000,"RS422",1000000,"RS422",1000000,"RS422",1000000,"RS422",1000000,"RS422",1000000,"RS422",1000000,"RS422",1000000,"RS422",1000000,"RS422",1000000,"RS422",1000000,"RS422",1000000,"RS422",1000000,"RS422",1000000,"RS422",1000000,"RS422",1000000,"RS422",1000000,"RS422",1000000,"RS422",1000000,"RS422",1000000,"RS422",1000000,"RS422",1000000,"RS422",1000000,"RS422",1000000,"RS422",1000000,"RS422",1000000,"RS422",1000000,"RS422",1000000,"RS422",1000000,"RS422",1000000,"RS422",1000000,"RS422",1000000,"RS422",1000000,"RS422",1000000,"RS422",1000000,"RS422",1000000,"RS422",1000000,"RS422",1000000,"RS422",1000000,"RS422",1000000,"RS422",1000000,"RS422",1000000,"RS422",1000000,"RS422",1000000,"RS422",1000000,"RS422",1000000,"RS422",1000000,"RS422",1000000,"RS422",1000000,"RS422",1000000,"RS422",1000000,"RS422",1000000,"RS422",1000000,"RS422",1000000,"RS422",1000000,"RS422",1000000,"RS422",1000000,"RS422",1000000,"RS422",1000000,"RS422",1000000,"RS422",1000000,"RS422",1000000,"RS422",1000000,"RS422",1000000,"RS422",1000000,"RS422",1000000,"RS422",1000000,"RS422",1000000,"RS422",1000000,"RS422",1000000,"RS422",1000000,"RS422",1000000,"RS422",1000000,"RS422",1000000,"RS422",1000000,"RS422",1000000,"RS422",1000000,"RS422",1000000,"RS422",1000000,"RS422",1000000,"RS422",1000000,"RS422",1000000,"RS422",1000000,"RS422",1000000,"RS422",1000000,"RS422",1000000,"RS422",1000000,"RS422",1000000,"RS422",1000000,"RS422",1000000,"RS422",1000000,"RS422",1000000,"RS422",1000000,"RS422",1000000,"RS422",1000000,"RS422",1000000,"RS422",1000000,"RS422",1000000,"RS422",1000000,"RS422",1000000,"RS422",1000000,"RS422",1000000,"RS422",1000000,"RS422",1000000,"RS422",1000000,"RS422",1000000,"RS422",1000000,"RS422",1000000,"RS422",1000000,"RS422",1000000,"RS422",1000000,"RS422",1000000,"RS422",1000000,"RS422",1000000,"RS422",1000000,"RS422",1000000,"RS422",1000000,"RS422",1000000,"RS422",1000000,"RS422",1000000,"RS422",1000000,"RS422",1000000,"RS422",1000000,"RS422",1000000,"RS422",1000000,"RS422",1000000,"RS422",1000000,"RS422",1000000,"RS422",1000000,"RS422",1000000,"RS422",1000000,"RS422",1000000,"RS422",1000000,"RS422",1000000,"RS422",1000000,"RS422",1000000,"RS422",1000000,"RS422",1000000,"RS422",1000000,"RS422",1000000,"RS422",1000000,"RS422",1000000,"RS422",1000000,"RS422",1000000,"RS422",1000000,"RS422",1000000,"RS422",1000000,"RS422",1000000,"RS422",1000000,"RS422",1000000,"RS422",1000000,"RS422",1000000,"RS422",1000000,"RS422",1000000,"RS422",1000000,"RS422",1000000,"RS422",1000000,"RS422",1000000,"RS422",1000000,"RS422",1000000,"RS422",1000000,"RS422",1000000,"RS422",1000000,"RS422",1000000,"RS422",1000000,"RS422",1000000,"RS422",1000000,"RS422",1000000,"RS422",1000000,"RS422",1000000,"RS422",1000000,"RS422",1000000,"RS422",1000000,"RS422",1000000,"RS422",1000000,"RS422",1000000,"RS422",1000000,"RS422",1000000,"RS422",1000000,"RS422",1000000,"RS422",1000000,"RS422",1000000,"RS422",1000000,"RS422",1000000,"RS422",1000000,"RS422",1000000,"RS422",1000000,"RS422",1000000,"RS422",1000000,"RS422",1000000,"RS422",1000000,"RS422",1000000,"RS422",1000000,"RS422",1000000,"RS422",1000000,"RS422",1000000,"RS422",1000000,"RS422",1000000,"RS422",1000000,"RS422",1000000,"RS422",1000000,"RS422",1000000,"RS422",1000000,"RS422",1000000,"RS422",1000000,"RS422",1000000,"RS422",1000000,"RS422",1000000,"RS422",1000000,"RS422",1000000,"RS422",1000000,"RS422",1000000,"RS422",1000000,"RS422",1000000,"RS422",1000000,"RS422",1000000,"RS422",1000000,"RS422",1000000,"RS422",1000000,"RS422",1000000,"RS422",1000000,"RS422",1000000,"RS422",1000000,"RS422",1000000,"RS422",1000000,"RS422",1000000,"RS422",1000000,"RS422",1000000,"RS422",1000000,"RS422",1000000,"RS422",1000000,"RS422",1000000,"RS422",1000000,"RS422",1000000,"RS422",1000000,"RS422",1000000,"RS422",1000000,"RS422",1000000,"RS422",1000000,"RS422",1000000,"RS422",1000000,"RS422",1000000,"RS422",1000000,"RS422",1000000,"RS422",1000000,"RS422",1000000,"RS422",1000000,"RS422",1000000,"RS422",1000000,"RS422",1000000,"RS422",1000000,"RS422",1000000,"RS422",1000000,"RS422",1000000,"RS422",1000000,"RS422",1000000,"RS422",1000000,"RS422",1000000,"RS422",1000000,"RS422",1000000,"RS422",1000000,"RS422",1000000,"RS422",1000000,"RS422",1000000,"RS422",1000000,"RS422",1000000,"RS422",1000000,"RS422",1000000,"RS422",1000000,"RS422",1000000,"RS422",1000000,"RS422",1000000,"RS422",1000000,"RS422",1000000,"RS422",1000000,"RS422",1000000,"RS422",1000000,"RS422",1000000,"RS422",1000000,"RS422",1000000,"RS422",1000000,"RS422",1000000,"RS422",1000000,"RS422",1000000,"RS422",1000000,"RS422",1000000,"RS422",1000000,"RS422",1000000,"RS422",1000000,"RS422",1000000,"RS422",1000000,"RS422",1000000,"RS422",1000000,"RS422",1000000,"RS422",1000000,"RS422",1000000,"RS422",1000000,"RS422",1000000,"RS422",1000000,"RS422",1000000,"RS422",1000000,"RS422",1000000,"RS422",1000000,"RS422",1000000,"RS422",1000000,"RS422",1000000,"RS422",1000000,"RS422",1000000,"RS422",1000000,"RS422",1000000,"RS422",1000000,"RS422",1000000,"RS422",1000000,"RS422",1000000,"RS422",1000000,"RS422",1000000,"RS422",1000000,"RS422",1000000,"RS422",1000000,"RS422",1000000,"RS422",1000000,"RS422",1000000,"RS422",1000000,"RS422",1000000,"RS422",1000000,"RS422",1000000,"RS422",1000000,"RS422",1000000,"RS422",1000000,"RS422",1000000,"RS422",1000000,"RS422",1000000,"RS422",1000000,"RS422",1000000,"RS422",1000000,"RS422",1000000,"RS422",1000000,"RS422",1000000,"RS422",1000000,"RS422",1000000,"RS422",1000000,"RS422",1000000,"RS422",1000000,"RS422",1000000,"RS422",1000000,"RS422",1000000,"RS422",1000000,"RS422",1000000,"RS422",1000000,"RS422",1000000,"RS422",1000000,"RS422",1000000,"RS422",1000000,"RS422",1000000,"RS422",1000000,"RS422",1000000,"RS422",1000000,"RS422",1000000,"RS422",1000000,"RS422",1000000,"RS422",1000000,"RS422",1000000,"RS422",1000000,"RS422",1000000,"RS422",1000000,"RS422",1000000,"RS422",1000000,"RS422",1000000,"RS422",1000000,"RS422",1000000,"RS422",1000000,"RS422",1000000,"RS422",1000000,"RS422",1000000,"RS422",1000000,"RS422",1000000,"RS422",1000000,"RS422",1000000,"RS422",1000000,"RS422",1000000,"RS422",1000000,"RS422",1000000,"RS422",1000000,"RS422",1000000,"RS422",1000000,"RS422",1000000,"RS422",1000000,"RS422",1000000,"RS422",1000000,"RS422",1000000,"RS422",1000000,"RS422",1000000,"RS422",1000000,"RS422",1000000,"RS422",1000000,"RS422",1000000,"RS422",1000000,"RS422",1000000,"RS422",1000000,"RS422",1000000,"RS422",1000000,"RS422",1000000,"RS422",1000000,"RS422",1000000,"RS422",1000000,"RS422",1000000,"RS422",1000000,"RS422",1000000,"RS422",1000000,"RS422",1000000,"RS422",1000000,"RS422",1000000,"RS422",1000000,"RS422",1000000,"RS422",1000000,"RS422",1000000,"RS422",1000000,"RS422",1000000,"RS422",1000000,"RS422",1000000,"RS422",1000000,"RS422",1000000,"RS422",1000000,"RS422",1000000,"RS422",1000000,"RS422",1000000,"RS422",1000000,"RS422",1000000,"RS422",1000000,"RS422",1000000,"RS422",1000000,"RS422",1000000,"RS422",1000000,"RS422",1000000,"RS422",1000000,"RS422",1000000,"RS422",1000000,"RS422",1000000,"RS422",1000000,"RS422",1000000,"RS422",1000000,"RS422",1000000,"RS422",1000000,"RS422",1000000,"RS422",1000000,"RS422",1000000,"RS422",1000000,"RS422",1000000,"RS422",1000000,"RS422",1000000,"RS422",1000000,"RS422",1000000,"RS422",1000000,"RS422",1000000,"RS422",1000000,"RS422",1000000,"RS422",1000000,"RS422",1000000,"RS422",1000000,"RS422",1000000,"RS422",1000000,"RS422",1000000,"RS422",1000000,"RS422",1000000,"RS422",1000000,"RS422",1000000,"RS422",1000000,"RS422",1000000,"RS422",1000000,"RS422",1000000,"RS422",1000000,"RS422",1000000,"RS422",1000000,"RS422",1000000,"RS422",1000000,"RS422",1000000,"RS422",1000000,"RS422",1000000,"RS422",1000000,"RS422",1000000,"RS422",1000000,"RS422",1000000,"RS422",1000000,"RS422",1000000,"RS422",1000000,"RS422",1000000,"RS422",1000000,"RS422",1000000,"RS422",1000000,"RS422",1000000,"RS422",1000000,"RS422",1000000,"RS422",1000000,"RS422",1000000,"RS422",1000000,"RS422",1000000,"RS422",1000000,"RS422",1000000,"RS422",1000000,"RS422",1000000,"RS422",1000000,"RS422",1000000,"RS422",1000000,"RS422",1000000,"RS422",1000000,"RS422",1000000,"RS422",1000000,"RS422",1000000,"RS422",1000000,"RS422",1000000,"RS422",1000000,"RS422",1000000,"RS422",1000000,"RS422",1000000,"RS422",1000000,"RS422",1000000,"RS422",1000000,"RS422",1000000,"RS422",1000000,"RS422",1000000,"RS422",1000000,"RS422",1000000,"RS422",1000000,"RS422",1000000,"RS422",1000000,"RS422",1000000,"RS422",1000000,"RS422",1000000,"RS422",1000000,"RS422",1000000,"RS422",1000000,"RS422",1000000,"RS422",1000000,"RS422",1000000,"RS422",1000000,"RS422",1000000,"RS422",1000000,"RS422",1000000,"RS422",1000000,"RS422",1000000,"RS422",1000000,"RS422",1000000,"RS422",1000000,"RS422",1000000,"RS422",1000000,"RS422",1000000,"RS422",1000000,"RS422",1000000,"RS422",1000000,"RS422",1000000,"RS422",1000000,"RS422",1000000,"RS422",1000000,"RS422",1000000,"RS422",1000000,"RS422",1000000,"RS422",1000000,"RS422",1000000,"RS422",1000000,"RS422",1000000,"RS422",1000000,"RS422",1000000,"RS422",1000000,"RS422",1000000,"RS422",1000000,"RS422",1000000,"RS422",1000000,"RS422",1000000,"RS422",1000000,"RS422",1000000,"RS422",1000000,"RS422",1000000,"RS422",1000000,"RS422",1000000,"RS422",1000000,"RS422",1000000,"RS422",1000000,"RS422",1000000,"RS422",1000000,"RS422",1000000,"RS422",1000000,"RS422",1000000,"RS422",1000000,"RS422",1000000,"RS422",1000000,"RS422",1000000,"RS422",1000000,"RS422",1000000,"RS422",1000000,"RS422",1000000,"RS422",1000000,"RS422",1000000,"RS422",1000000,"RS422",1000000,"RS422",1000000,"RS422",1000000,"RS422",1000000,"RS422",1000000,"RS422",1000000,"RS422",1000000,"RS422",1000000,"RS422",1000000,"RS422",1000000,"RS422",1000000,"RS422",1000000,"RS422",1000000,"RS422",1000000,"RS422",1000000,"RS422",1000000,"RS422",1000000,"RS422",1000000,"RS422",1000000,"RS422",1000000,"RS422",1000000,"RS422",1000000,"RS422",1000000,"RS422",1000000,"RS422",1000000,"RS422",1000000,"RS422",1000000,"RS422",1000000,"RS422",1000000,"RS422",1000000,"RS422",1000000,"RS422",1000000,"RS422",1000000,"RS422",1000000,"RS422",1000000,"RS422",1000000,"RS422",1000000,"RS422",1000000,"RS422",1000000,"RS422",1000000,"RS422",1000000,"RS422",1000000,"RS422",1000000,"RS422",1000000,"RS422",1000000,"RS422",1000000,"RS422",1000000,"RS422",1000000,"RS422",1000000,"RS422",1000000,"RS422",1000000,"RS422",1000000,"RS422",1000000,"RS422",1000000,"RS422",1000000,"RS422",1000000,"RS422",1000000,"RS422",1000000,"RS422",1000000,"RS422",1000000,"RS422",1000000,"RS422",1000000,"RS422",1000000,"RS422",1000000,"RS422",1000000,"RS422",1000000,"RS422",1000000,"RS422",1000000,"RS422",1000000,"RS422",1000000,"RS422",1000000,"RS422",1000000,"RS422",1000000,"RS422",1000000,"RS422",1000000,"RS422",1000000,"RS422",1000000,"RS422",1000000,"RS422",1000000,"RS422",1000000,"RS422",1000000,"RS422",1000000,"RS422",1000000,"RS422",1000000,"RS422",1000000,"RS422",1000000,"RS422",1000000,"RS422",1000000,"RS422",1000000,"RS422",1000000,"RS422",1000000,"RS422",1000000,"RS422",1000000,"RS422",1000000,"RS422",1000000,"RS422",1000000,"RS422",1000000,"RS422",1000000,"RS422",1000000,"RS422",1000000,"RS422",1000000,"RS422",1000000,"RS422",1000000,"RS422",1000000,"RS422",1000000,"RS422",1000000,"RS422",1000000,"RS422",1000000,"RS422",1000000,"RS422",1000000,"RS422",1000000,"RS422",1000000,"RS422",1000000,"RS422",1000000,"RS422",1000000,"RS422",1000000,"RS422",1000000,"RS422",1000000,"RS422",1000000,"RS422",1000000,"RS422",1000000,"RS422",1000000,"RS422",1000000,"RS422",1000000,"RS422",1000000,"RS422",1000000,"RS422",1000000,"RS422",1000000,"RS422",1000000,"RS422",1000000,"RS422",1000000,"RS422",1000000,"RS422",1000000,"RS422",1000000,"RS422",1000000,"RS422",1000000,"RS422",1000000,"RS422",1000000,"RS422",1000000,"RS422",1000000,"RS422",1000000,"RS422",1000000,"RS422",1000000,"RS422",1000000,"RS422",1000000,"RS422",1000000,"RS422",1000000,"RS422",1000000,"RS422",1000000,"RS422",1000000,"RS422",1000000,"RS422",1000000,"RS422",1000000,"RS422",1000000,"RS422",1000000,"RS422",1000000,"RS422",1000000,"RS422",1000000,"RS422",1000000,"RS422",1000000,"RS422",1000000,"RS422",1000000,"RS422",1000000,"RS422",1000000,"RS422",1000000,"RS422",1000000,"RS422",1000000,"RS422",1000000,"RS422",1000000,"RS422",1000000,"RS422",1000000,"RS422",1000000,"RS422",1000000,"RS422",1000000,"RS422",1000000,"RS422",1000000,"RS422",1000000,"RS422",1000000,"RS422",1000000,"RS422",1000000,"RS422",1000000,"RS422",1000000,"RS422",1000000,"RS422",1000000,"RS422",1000000,"RS422",1000000,"RS422",1000000,"RS422",1000000,"RS422",1000000,"RS422",1000000,"RS422",1000000,"RS422",1000000,"RS422",1000000,"RS422",1000000,"RS422",1000000,"RS422",1000000,"RS422",1000000,"RS422",1000000,"RS422",1000000,"RS422",1000000,"RS422",1000000,"RS422",1000000,"RS422",1000000,"RS422",1000000,"RS422",1000000,"RS422",1000000,"RS422",1000000,"RS422",1000000,"RS422",1000000,"RS422",1000000,"RS422",1000000,"RS422",1000000,"RS422",1000000,"RS422",1000000,"RS422",1000000,"RS422",1000000,"RS422",1000000,"RS422",1000000,"RS422",1000000,"RS422",1000000,"RS422",1000000,"RS422",1000000,"RS422",1000000,"RS422",1000000,"RS422",1000000,"RS422",1000000,"RS422",1000000,"RS422",1000000,"RS422",1000000,"RS422",1000000,"RS422",1000000,"RS422",1000000,"RS422",1000000,"RS422",1000000,"RS422",1000000,"RS422",1000000,"RS422",1000000,"RS422",1000000,"RS422",1000000,"RS422",1000000,"RS422",1000000,"RS422",1000000,"RS422",1000000,"RS422",1000000,"RS422",1000000,"RS422",1000000,"RS422",1000000,"RS422",1000000,"RS422",1000000,"RS422",1000000,"RS422",1000000,"RS422",1000000,"RS422",1000000,"RS422",1000000,"RS422",1000000,"RS422",1000000,"RS422",1000000,"RS422",1000000,"RS422",1000000,"RS422",1000000,"RS422",1000000,"RS422",1000000,"RS422",1000000,"RS422",1000000,"RS422",1000000,"RS422",1000000,"RS422",1000000,"RS422",1000000,"RS422",1000000,"RS422",1000000,"RS422",1000000,"RS422",1000000,"RS422",1000000,"RS422",1000000,"RS422",1000000,"RS422",1000000,"RS422",1000000,"RS422",1000000,"RS422",1000000,"RS422",1000000,"RS422",1000000,"RS422",1000000,"RS422",1000000,"RS422",1000000,"RS422",1000000,"RS422",1000000,"RS422",1000000,"RS422",1000000,"RS422",1000000,"RS422",1000000,"RS422",1000000,"RS422",1000000,"RS422",1000000,"RS422",1000000,"RS422",1000000,"RS422",1000000,"RS422",1000000,"RS422",1000000,"RS422",1000000,"RS422",1000000,"RS422",1000000,"RS422",1000000,"RS422",1000000,"RS422",1000000,"RS422",1000000,"RS422",1000000,"RS422",1000000,"RS422",1000000,"RS422",1000000,"RS422",1000000,"RS422",1000000,"RS422",1000000,"RS422",1000000,"RS422",1000000,"RS422",1000000,"RS422",1000000,"RS422",1000000,"RS422",1000000,"RS422",1000000,"RS422",1000000,"RS422",1000000,"RS422",1000000,"RS422",1000000,"RS422",1000000,"RS422",1000000,"RS422",1000000,"RS422",1000000,"RS422",1000000,"RS422",1000000,"RS422",1000000,"RS422",1000000,"RS422",1000000,"RS422",1000000,"RS422",1000000,"RS422",1000000,"RS422",1000000,"RS422",1000000,"RS422",1000000,"RS422",1000000,"RS422",1000000,"RS422",1000000,"RS422",1000000,"RS422",1000000,"RS422",1000000,"RS422",1000000,"RS422",1000000,"RS422",1000000,"RS422",1000000,"RS422",1000000,"RS422",1000000,"RS422",1000000,"RS422",1000000,"RS422",1000000,"RS422",1000000,"RS422",1000000,"RS422",1000000,"RS422",1000000,"RS422",1000000,"RS422",1000000,"RS422",1000000,"RS422",1000000,"RS422",1000000,"RS422",1000000,"RS422",1000000,"RS422",1000000,"RS422",1000000,"RS422",1000000,"RS422",1000000,"RS422",1000000,"RS422",1000000,"RS422",1000000,"RS422",1000000,"RS422",1000000,"RS422",1000000,"RS422",1000000,"RS422",1000000,"RS422",1000000,"RS422",1000000,"RS422",1000000,"RS422",1000000,"RS422",1000000,"RS422",1000000,"RS422",1000000,"RS422",1000000,"RS422",1000000,"RS422",1000000,"RS422",1000000,"RS422",1000000,"RS422",1000000,"RS422",1000000,"RS422",1000000,"RS422",1000000,"RS422",1000000,"RS422",1000000,"RS422",1000000,"RS422",1000000,"RS422",1000000,"RS422",1000000,"RS422",1000000,"RS422",1000000,"RS422",1000000,"RS422",1000000,"RS422",1000000,"RS422",1000000,"RS422",1000000,"RS422",1000000,"RS422",1000000,"RS422",1000000,"RS422",1000000,"RS422",1000000,"RS422",1000000,"RS422",1000000,"RS422",1000000,"RS422",1000000,"RS422",1000000,"RS422",1000000,"RS422",1000000,"RS422",1000000,"RS422",1000000,"RS422",1000000,"RS422",1000000,"RS422",1000000,"RS422",1000000,"RS422",1000000,"RS422",1000000,"RS422",1000000,"RS422",1000000,"RS422",1000000,"RS422",1000000,"RS422",1000000,"RS422",1000000,"RS422",1000000,"RS422",1000000,"RS422",1000000,"RS422",1000000,"RS422",1000000,"RS422",1000000,"RS422",1000000,"RS422",1000000,"RS422",1000000,"RS422",1000000,"RS422",1000000,"RS422",1000000,"RS422",1000000,"RS422",1000000,"RS422",1000000,"RS422",1000000,"RS422",1000000,"RS422",1000000,"RS422",1000000,"RS422",1000000,"RS422",1000000,"RS422",1000000,"RS422",1000000,"RS422",1000000,"RS422",1000000,"RS422",1000000,"RS422",1000000,"RS422",1000000,"RS422",1000000,"RS422",1000000,"RS422",1000000,"RS422",1000000,"RS422",1000000,"RS422",1000000,"RS422",1000000,"RS422",1000000,"RS422",1000000,"RS422",1000000,"RS422",1000000,"RS422",1000000,"RS422",1000000,"RS422",1000000,"RS422",1000000,"RS422",1000000,"RS422",1000000,"RS422",1000000,"RS422",1000000,"RS422",1000000,"RS422",1000000,"RS422",1000000,"RS422",1000000,"RS422",1000000,"RS422",1000000,"RS422",1000000,"RS422",1000000,"RS422",1000000,"RS422",1000000,"RS422",1000000,"RS422",1000000,"RS422",1000000,"RS422",1000000,"RS422",1000000,"RS422",1000000,"RS422",1000000,"RS422",1000000,"RS422",1000000,"RS422",1000000,"RS422",1000000,"RS422",1000000,"RS422",1000000,"RS422",1000000,"RS422",1000000,"RS422",1000000,"RS422",1000000,"RS422",1000000,"RS422",1000000,"RS422",1000000,"RS422",1000000,"RS422",1000000,"RS422",1000000,"RS422",1000000,"RS422",1000000,"RS422",1000000,"RS422",1000000,"RS422",1000000,"RS422",1000000,"RS422",1000000,"RS422",1000000,"RS422",1000000,"RS422",1000000,"RS422",1000000,"RS422",1000000,"RS422",1000000,"RS422",1000000,"RS422",1000000,"RS422",1000000,"RS422",1000000,"RS422",1000000,"RS422",1000000,"RS422",1000000,"RS422",1000000,"RS422",1000000,"RS422",1000000,"RS422",1000000,"RS422",1000000,"RS422",1000000,"RS422",1000000,"RS422",1000000,"RS422",1000000,"RS422",1000000,"RS422",1000000,"RS422",1000000,"RS422",1000000,"RS422",1000000,"RS422",1000000,"RS422",1000000,"RS422",1000000,"RS422",1000000,"RS422",1000000,"RS422",1000000,"RS422",1000000,"RS422",1000000,"RS422",1000000,"RS422",1000000,"RS422",1000000,"RS422",1000000,"RS422",1000000,"RS422",1000000,"RS422",1000000,"RS422",1000000,"RS422",1000000,"RS422",1000000,"RS422",1000000,"RS422",1000000,"RS422",1000000,"RS422",1000000,"RS422",1000000,"RS422",1000000,"RS422",1000000,"RS422",1000000,"RS422",1000000,"RS422",1000000,"RS422",1000000,"RS422",1000000,"RS422",1000000,"RS422",1000000,"RS422",1000000,"RS422",1000000,"RS422",1000000,"RS422",1000000,"RS422",1000000,"RS422",1000000,"RS422",1000000,"RS422",1000000,"RS422",1000000,"RS422",1000000,"RS422",1000000,"RS422",1000000,"RS422",1000000,"RS422",1000000,"RS422",1000000,"RS422",1000000,"RS422",1000000,"RS422",1000000,"RS422",1000000,"RS422",1000000,"RS422",1000000,"RS422",1000000,"RS422",1000000,"RS422",1000000,"RS422",1000000,"RS422",1000000,"RS422",1000000,"RS422",1000000,"RS422",1000000,"RS422",1000000,"RS422",1000000,"RS422",1000000,"RS422",1000000,"RS422",1000000,"RS422",1000000,"RS422",1000000,"RS422",1000000,"RS422",1000000,"RS422",1000000,"RS422",1000000,"RS422",1000000,"RS422",1000000,"RS422",1000000,"RS422",1000000,"RS422",1000000,"RS422",1000000,"RS422",1000000,"RS422",1000000,"RS422",1000000,"RS422",1000000,"RS422",1000000,"RS422",1000000,"RS422",1000000,"RS422",1000000,"RS422",1000000,"RS422",1000000,"RS422",1000000,"RS422",1000000,"RS422",1000000,"RS422",1000000,"RS422",1000000,"RS422",1000000,"RS422",1000000,"RS422",1000000,"RS422",1000000,"RS422",1000000,"RS422",1000000,"RS422",1000000,"RS422",1000000,"RS422",1000000,"RS422",1000000,"RS422",1000000,"RS422",1000000,"RS422",1000000,"RS422",1000000,"RS422",1000000,"RS422",1000000,"RS422",1000000,"RS422",1000000,"RS422",1000000,"RS422",1000000,"RS422",1000000,"RS422",1000000,"RS422",1000000,"RS422",1000000,"RS422",1000000,"RS422",1000000,"RS422",1000000,"RS422",1000000,"RS422",1000000,"RS422",1000000,"RS422",1000000,"RS422",1000000,"RS422",1000000,"RS422",1000000,"RS422",1000000,"RS422",1000000,"RS422",1000000,"RS422",1000000,"RS422",1000000,"RS422",1000000,"RS422",1000000,"RS422",1000000,"RS422",1000000,"RS422",1000000,"RS422",1000000,"RS422",1000000,"RS422",1000000,"RS422",1000000,"RS422",1000000,"RS422",1000000,"RS422",1000000,"RS422",1000000,"RS422",1000000,"RS422",1000000,"RS422",1000000,"RS422",1000000,"RS422",1000000,"RS422",1000000,"RS422",1000000,"RS422",1000000,"RS422",1000000,"RS422",1000000,"RS422",1000000,"RS422",1000000,"RS422",1000000,"RS422",1000000,"RS422",1000000,"RS422",1000000,"RS422",1000000,"RS422",1000000,"RS422",1000000,"RS422",1000000,"RS422",1000000,"RS422",1000000,"RS422",1000000,"RS422",1000000,"RS422",1000000,"RS422",1000000,"RS422",1000000,"RS422",1000000,"RS422",1000000,"RS422",1000000,"RS422",1000000,"RS422",1000000,"RS422",1000000,"RS422",1000000,"RS422",1000000,"RS422",1000000,"RS422",1000000,"RS422",1000000,"RS422",1000000,"RS422",1000000,"RS422",1000000,"RS422",1000000,"RS422",1000000,"RS422",1000000,"RS422",1000000,"RS422",1000000,"RS422",1000000,"RS422",1000000,"RS422",1000000,"RS422",1000000,"RS422",1000000,"RS422",1000000,"RS422",1000000,"RS422",1000000,"RS422",1000000,"RS422",1000000,"RS422",1000000,"RS422",1000000,"RS422",1000000,"RS422",1000000,"RS422",1000000,"RS422",1000000,"RS422",1000000,"RS422",1000000,"RS422",1000000,"RS422",1000000,"RS422",1000000,"RS422",1000000,"RS422",1000000,"RS422",1000000,"RS422",1000000,"RS422",1000000,"RS422",1000000,"RS422",1000000,"RS422",1000000,"RS422",1000000,"RS422",1000000,"RS422",1000000,"RS422",1000000,"RS422",1000000,"RS422",1000000,"RS422",1000000,"RS422",1000000,"RS422",1000000,"RS422",1000000,"RS422",1000000,"RS422",1000000,"RS422",1000000,"RS422",1000000,"RS422",1000000,"RS422",1000000,"RS422",1000000,"RS422",1000000,"RS422",1000000,"RS422",1000000,"RS422",1000000,"RS422",1000000,"RS422",1000000,"RS422",1000000,"RS422",1000000,"RS422",1000000,"RS422",1000000,"RS422",1000000,"RS422",1000000,"RS422",1000000,"RS422",1000000,"RS422",1000000,"RS422",1000000,"RS422",1000000,"RS422",1000000,"RS422",1000000,"RS422",1000000,"RS422",1000000,"RS422",1000000,"RS422",1000000,"RS422",1000000,"RS422",1000000,"RS422",1000000,"RS422",1000000,"RS422",1000000,"RS422",1000000,"RS422",1000000,"RS422",1000000,"RS422",1000000,"RS422",1000000,"RS422",1000000,"RS422",1000000,"RS422",1000000,"RS422",1000000,"RS422",1000000,"RS422",1000000,"RS422",1000000,"RS422",1000000,"RS422",1000000,"RS422",1000000,"RS422",1000000,"RS422",1000000,"RS422",1000000,"RS422",1000000,"RS422",1000000,"RS422",1000000,"RS422",1000000,"RS422",1000000,"RS422",1000000,"RS422",1000000,"RS422",1000000,"RS422",1000000,"RS422",1000000,"RS422",1000000,"RS422",1000000,"RS422",1000000,"RS422",1000000,"RS422",1000000,"RS422",1000000,"RS422",1000000,"RS422",1000000,"RS422",1000000,"RS422",1000000,"RS422",1000000,"RS422",1000000,"RS422",1000000,"RS422",1000000,"RS422",1000000,"RS422",1000000,"RS422",1000000,"RS422",1000000,"RS422",1000000,"RS422",1000000,"RS422",1000000,"RS422",1000000,"RS422",1000000,"RS422",1000000,"RS422",1000000,"RS422",1000000,"RS422",1000000,"RS422",1000000,"RS422",1000000,"RS422",1000000,"RS422",1000000,"RS422",1000000,"RS422",1000000,"RS422",1000000,"RS422",1000000,"RS422",1000000,"RS422",1000000,"RS422",1000000,"RS422",1000000,"RS422",1000000,"RS422",1000000,"RS422",1000000,"RS422",1000000,"RS422",1000000,"RS422",1000000,"RS422",1000000,"RS422",1000000,"RS422",1000000,"RS422",1000000,"RS422",1000000,"RS422",1000000,"RS422",1000000,"RS422",1000000,"RS422",1000000,"RS422",1000000,"RS422",1000000,"RS422",1000000,"RS422",1000000,"RS422",1000000,"RS422",1000000,"RS422",1000000,"RS422",1000000,"RS422",1000000,"RS422",1000000,"RS422",1000000,"RS422",1000000,"RS422",1000000,"RS422",1000000,"RS422",1000000,"RS422",1000000,"RS422",1000000,"RS422",1000000,"RS422",1000000,"RS422",1000000,"RS422",1000000,"RS422",1000000,"RS422",1000000,"RS422",1000000,"RS422",1000000,"RS422",1000000,"RS422",1000000,"RS422",1000000,"RS422",1000000,"RS422",1000000,"RS422",1000000,"RS422",1000000,"RS422",1000000,"RS422",1000000,"RS422",1000000,"RS422",1000000,"RS422",1000000,"RS422",1000000,"RS422",1000000,"RS422",1000000,"RS422",1000000,"RS422",1000000,"RS422",1000000,"RS422",1000000,"RS422",1000000,"RS422",1000000,"RS422",1000000,"RS422",1000000,"RS422",1000000,"RS422",1000000,"RS422",1000000,"RS422",1000000,"RS422",1000000,"RS422",1000000,"RS422",1000000,"RS422",1000000,"RS422",1000000,"RS422",1000000,"RS422",1000000,"RS422",1000000,"RS422",1000000,"RS422",1000000,"RS422",1000000,"RS422",1000000,"RS422",1000000,"RS422",1000000,"RS422",1000000,"RS422",1000000,"RS422",1000000,"RS422",1000000,"RS422",1000000,"RS422",1000000,"RS422",1000000,"RS422",1000000,"RS422",1000000,"RS422",1000000,"RS422",1000000,"RS422",1000000,"RS422",1000000,"RS422",1000000,"RS422",1000000,"RS422",1000000,"RS422",1000000,"RS422",1000000,"RS422",1000000,"RS422",1000000,"RS422",1000000,"RS422",1000000,"RS422",1000000,"RS422",1000000,"RS422",1000000,"RS422",1000000,"RS422",1000000,"RS422",1000000,"RS422",1000000,"RS422",1000000,"RS422",1000000,"RS422",1000000,"RS422",1000000,"RS422",1000000,"RS422",1000000,"RS422",1000000,"RS422",1000000,"RS422",1000000,"RS422",1000000,"RS422",1000000,"RS422",1000000,"RS422",1000000,"RS422",1000000,"RS422",1000000,"RS422",1000000,"RS422",1000000,"RS422",1000000,"RS422",1000000,"RS422",1000000,"RS422",1000000,"RS422",1000000,"RS422",1000000,"RS422",1000000,"RS422",1000000,"RS422",1000000,"RS422",1000000,"RS422",1000000,"RS422",1000000,"RS422",1000000,"RS422",1000000,"RS422",1000000,"RS422",1000000,"RS422",1000000,"RS422",1000000,"RS422",1000000,"RS422",1000000,"RS422",1000000,"RS422",1000000,"RS422",1000000,"RS422",1000000,"RS422",1000000,"RS422",1000000,"RS422",1000000,"RS422",1000000,"RS422",1000000,"RS422",1000000,"RS422",1000000,"RS422",1000000,"RS422",1000000,"RS422",1000000,"RS422",1000000,"RS422",1000000,"RS422",1000000,"RS422",1000000,"RS422",1000000,"RS422",1000000,"RS422",1000000,"RS422",1000000,"RS422",1000000,"RS422",1000000,"RS422",1000000,"RS422",1000000,"RS422",1000000,"RS422",1000000,"RS422",1000000,"RS422",1000000,"RS422",1000000,"RS422",1000000,"RS422",1000000,"RS422",1000000,"RS422",1000000,"RS422",1000000,"RS422",1000000,"RS422",1000000,"RS422",1000000,"RS422",1000000,"RS422",1000000,"RS422",1000000,"RS422",1000000,"RS422",1000000,"RS422",1000000,"RS422",1000000,"RS422",1000000,"RS422",1000000,"RS422",1000000,"RS422",1000000,"RS422",1000000,"RS422",1000000,"RS422",1000000,"RS422",1000000,"RS422",1000000,"RS422",1000000,"RS422",1000000,"RS422",1000000,"RS422",1000000,"RS422",1000000,"RS422",1000000,"RS422",1000000,"RS422",1000000,"RS422",1000000,"RS422",1000000,"RS422",1000000,"RS422",1000000,"RS422",1000000,"RS422",1000000,"RS422",1000000,"RS422",1000000,"RS422",1000000,"RS422",1000000,"RS422",1000000,"RS422",1000000,"RS422",1000000,"RS422",1000000,"RS422",1000000,"RS422",1000000,"RS422",1000000,"RS422",1000000,"RS422",1000000,"RS422",1000000,"RS422",1000000,"RS422",1000000,"RS422",1000000,"RS422",1000000,"RS422",1000000,"RS422",1000000,"RS422",1000000,"RS422",1000000,"RS422",1000000,"RS422",1000000,"RS422",1000000,"RS422",1000000,"RS422",1000000,"RS422",1000000,"RS422",1000000,"RS422",1000000,"RS422",1000000,"RS422",1000000,"RS422",1000000,"RS422",1000000,"RS422",1000000,"RS422",1000000,"RS422",1000000,"RS422",1000000,"RS422",1000000,"RS422",1000000,"RS422",1000000,"RS422",1000000,"RS422",1000000,"RS422",1000000,"RS422",1000000,"RS422",1000000,"RS422",1000000,"RS422",1000000,"RS422",1000000,"RS422",1000000,"RS422",1000000,"RS422",1000000,"RS422",1000000,"RS422",1000000,"RS422",1000000,"RS422",1000000,"RS422",1000000,"RS422",1000000,"RS422",1000000,"RS422",1000000,"RS422",1000000,"RS422",1000000,"RS422",1000000,"RS422",1000000,"RS422",1000000,"RS422",1000000,"RS422",1000000,"RS422",1000000,"RS422",1000000,"RS422",1000000,"RS422",1000000,"RS422",1000000,"RS422",1000000,"RS422",1000000,"RS422",1000000,"RS422",1000000,"RS422",1000000,"RS422",1000000,"RS422",1000000,"RS422",1000000,"RS422",1000000,"RS422",1000000,"RS422",1000000,"RS422",1000000,"RS422",1000000,"RS422",1000000,"RS422",1000000,"RS422",1000000,"RS422",1000000,"RS422",1000000,"RS422",1000000,"RS422",1000000,"RS422",1000000,"RS422",1000000,"RS422",1000000,"RS422",1000000,"RS422",1000000,"RS422",1000000,"RS422",1000000,"RS422",1000000,"RS422",1000000,"RS422",1000000,"RS422",1000000,"RS422",1000000,"RS422",1000000,"RS422",1000000,"RS422",1000000,"RS422",1000000,"RS422",1000000,"RS422",1000000,"RS422",1000000,"RS422",1000000,"RS422",1000000,"RS422",1000000,"RS422",1000000,"RS422",1000000,"RS422",1000000,"RS422",1000000,"RS422",1000000,"RS422",1000000,"RS422",1000000,"RS422",1000000,"RS422",1000000,"RS422",1000000,"RS422",1000000,"RS422",1000000,"RS422",1000000,"RS422",1000000,"RS422",1000000,"RS422",1000000,"RS422",1000000,"RS422",1000000,"RS422",1000000,"RS422",1000000,"RS422",1000000,"RS422",1000000,"RS422",1000000,"RS422",1000000,"RS422",1000000,"RS422",1000000,"RS422",1000000,"RS422",1000000,"RS422",1000000,"RS422",1000000,"RS422",1000000,"RS422",1000000,"RS422",1000000,"RS422",1000000,"RS422",1000000,"RS422",1000000,"RS422",1000000,"RS422",1000000,"RS422",1000000,"RS422",1000000,"RS422",1000000,"RS422",1000000,"RS422",1000000,"RS422",1000000,"RS422",1000000,"RS422",1000000,"RS422",1000000,"RS422",1000000,"RS422",1000000,"RS422",1000000,"RS422",1000000,"RS422",1000000,"RS422",1000000,"RS422",1000000,"RS422",1000000,"RS422",1000000,"RS422",1000000,"RS422",1000000,"RS422",1000000,"RS422",1000000,"RS422",1000000,"RS422",1000000,"RS422",1000000,"RS422",1000000,"RS422",1000000,"RS422",1000000,"RS422",1000000,"RS422",1000000,"RS422",1000000,"RS422",1000000,"RS422",1000000,"RS422",1000000,"RS422",1000000,"RS422",1000000,"RS422",1000000,"RS422",1000000,"RS422",1000000,"RS422",1000000,"RS422",1000000,"RS422",1000000,"RS422",1000000,"RS422",1000000,"RS422",1000000,"RS422",1000000,"RS422",1000000,"RS422",1000000,"RS422",1000000,"RS422",1000000,"RS422",1000000,"RS422",1000000,"RS422",1000000,"RS422",1000000,"RS422",1000000,"RS422",1000000,"RS422",1000000,"RS422",1000000,"RS422",1000000,"RS422",1000000,"RS422",1000000,"RS422",1000000,"RS422",1000000,"RS422",1000000,"RS422",1000000,"RS422",1000000,"RS422",1000000,"RS422",1000000,"RS422",1000000,"RS422",1000000,"RS422",1000000,"RS422",1000000,"RS422",1000000,"RS422",1000000,"RS422",1000000,"RS422",1000000,"RS422",1000000,"RS422",1000000,"RS422",1000000,"RS422",1000000,"RS422",1000000,"RS422",1000000,"RS422",1000000,"RS422",1000000,"RS422",1000000,"RS422",1000000,"RS422",1000000,"RS422",1000000,"RS422",1000000,"RS422",1000000,"RS422",1000000,"RS422",1000000,"RS422",1000000,"RS422",1000000,"RS422",1000000,"RS422",1000000,"RS422",1000000,"RS422",1000000,"RS422",1000000,"RS422",1000000,"RS422",1000000,"RS422",1000000,"RS422",1000000,"RS422",1000000,"RS422",1000000,"RS422",1000000,"RS422",1000000,"RS422",1000000,"RS422",1000000,"RS422",1000000,"RS422",1000000,"RS422",1000000,"RS422",1000000,"RS422",1000000,"RS422",1000000,"RS422",1000000,"RS422",1000000,"RS422",1000000,"RS422",1000000,"RS422",1000000,"RS422",1000000,"RS422",1000000,"RS422",1000000,"RS422",1000000,"RS422",1000000,"RS422",1000000,"RS422",1000000,"RS422",1000000,"RS422",1000000,"RS422",1000000,"RS422",1000000,"RS422",1000000,"RS422",1000000,"RS422",1000000,"RS422",1000000,"RS422",1000000,"RS422",1000000,"RS422",1000000,"RS422",1000000,"RS422",1000000,"RS422",1000000,"RS422",1000000,"RS422",1000000,"RS422",1000000,"RS422",1000000,"RS422",1000000,"RS422",1000000,"RS422",1000000,"RS422",1000000,"RS422",1000000,"RS422",1000000,"RS422",1000000,"RS422",1000000,"RS422",1000000,"RS422",1000000,"RS422",1000000,"RS422",1000000,"RS422",1000000,"RS422",1000000,"RS422",1000000,"RS422",1000000,"RS422",1000000,"RS422",1000000,"RS422",1000000,"RS422",1000000,"RS422",1000000,"RS422",1000000,"RS422",1000000,"RS422",1000000,"RS422",1000000,"RS422",1000000,"RS422",1000000,"RS422",1000000,"RS422",1000000,"RS422",1000000,"RS422",1000000,"RS422",1000000,"RS422",1000000,"RS422",1000000,"RS422",1000000,"RS422",1000000,"RS422",1000000,"RS422",1000000,"RS422",1000000,"RS422",1000000,"RS422",1000000,"RS422",1000000,"RS422",1000000,"RS422",1000000,"RS422",1000000,"RS422",1000000,"RS422",1000000,"RS422",1000000,"RS422",1000000,"RS422",1000000,"RS422",1000000,"RS422",1000000,"RS422",1000000,"RS422",1000000,"RS422",1000000,"RS422",1000000,"RS422",1000000,"RS422",1000000,"RS422",1000000,"RS422",1000000,"RS422",1000000,"RS422",1000000,"RS422",1000000,"RS422",1000000,"RS422",1000000,"RS422",1000000,"RS422",1000000,"RS422",1000000,"RS422",1000000,"RS422",1000000,"RS422",1000000,"RS422",1000000,"RS422",1000000,"RS422",1000000,"RS422",1000000,"RS422",1000000,"RS422",1000000,"RS422",1000000,"RS422",1000000,"RS422",1000000,"RS422",1000000,"RS422",1000000,"RS422",1000000,"RS422",1000000,"RS422",1000000,"RS422",1000000,"RS422",1000000,"RS422",1000000,"RS422",1000000,"RS422",1000000,"RS422",1000000,"RS422",1000000,"RS422",1000000,"RS422",1000000,"RS422",1000000,"RS422",1000000,"RS422",1000000,"RS422",1000000,"RS422",1000000,"RS422",1000000,"RS422",1000000,"RS422",1000000,"RS422",1000000,"RS422",1000000,"RS422",1000000,"RS422",1000000,"RS422",1000000,"RS422",1000000,"RS422",1000000,"RS422",1000000,"RS422",1000000,"RS422",1000000,"RS422",1000000,"RS422",1000000,"RS422",1000000,"RS422",1000000,"RS422",1000000,"RS422",1000000,"RS422",1000000,"RS422",1000000,"RS422",1000000,"RS422",1000000,"RS422",1000000,"RS422",1000000,"RS422",1000000,"RS422",1000000,"RS422",1000000,"RS422",1000000,"RS422",1000000,"RS422",1000000,"RS422",1000000,"RS422",1000000,"RS422",1000000,"RS422",1000000,"RS422",1000000,"RS422",1000000,"RS422",1000000,"RS422",1000000,"RS422",1000000,"RS422",1000000,"RS422",1000000,"RS422",1000000,"RS422",1000000,"RS422",1000000,"RS422",1000000,"RS422",1000000,"RS422",1000000,"RS422",1000000,"RS422",1000000,"RS422",1000000,"RS422",1000000,"RS422",1000000,"RS422",1000000,"RS422",1000000,"RS422",1000000,"RS422",1000000,"RS422",1000000,"RS422",1000000,"RS422",1000000,"RS422",1000000,"RS422",1000000,"RS422",1000000,"RS422",1000000,"RS422",1000000,"RS422",1000000,"RS422",1000000,"RS422",1000000,"RS422",1000000,"RS422",1000000,"RS422",1000000,"RS422",1000000,"RS422",1000000,"RS422",1000000,"RS422",1000000,"RS422",1000000,"RS422",1000000,"RS422",1000000,"RS422",1000000,"RS422",1000000,"RS422",1000000,"RS422",1000000,"RS422",1000000,"RS422",1000000,"RS422",1000000,"RS422",1000000,"RS422",1000000,"RS422",1000000,"RS422",1000000,"RS422",1000000,"RS422",1000000,"RS422",1000000,"RS422",1000000,"RS422",1000000,"RS422",1000000,"RS422",1000000,"RS422",1000000,"RS422",1000000,"RS422",1000000,"RS422",1000000,"RS422",1000000,"RS422",1000000,"RS422",1000000,"RS422",1000000,"RS422",1000000,"RS422",1000000,"RS422",1000000,"RS422",1000000,"RS422",1000000,"RS422",1000000,"RS422",1000000,"RS422",1000000,"RS422",1000000,"RS422",1000000,"RS422",1000000,"RS422",1000000,"RS422",1000000,"RS422",1000000,"RS422",1000000,"RS422",1000000,"RS422",1000000,"RS422",1000000,"RS422",1000000,"RS422",1000000,"RS422",1000000,"RS422",1000000,"RS422",1000000,"RS422",1000000,"RS422",1000000,"RS422",1000000,"RS422",1000000,"RS422",1000000,"RS422",1000000,"RS422",1000000,"RS422",1000000,"RS422",1000000,"RS422",1000000,"RS422",1000000,"RS422",1000000,"RS422",1000000,"RS422",1000000,"RS422",1000000,"RS422",1000000,"RS422",1000000,"RS422",1000000,"RS422",1000000,"RS422",1000000,"RS422",1000000,"RS422",1000000,"RS422",1000000,"RS422",1000000,"RS422",1000000,"RS422",1000000,"RS422",1000000,"RS422",1000000,"RS422",1000000,"RS422",1000000,"RS422",1000000,"RS422",1000000,"RS422",1000000,"RS422",1000000,"RS422",1000000,"RS422",1000000,"RS422",1000000,"RS422",1000000,"RS422",1000000,"RS422",1000000,"RS422",1000000,"RS422",1000000,"RS422",1000000,"RS422",1000000,"RS422",1000000,"RS422",1000000,"RS422",1000000,"RS422",1000000,"RS422",1000000,"RS422",1000000,"RS422",1000000,"RS422",1000000,"RS422",1000000,"RS422",1000000,"RS422",1000000,"RS422",1000000,"RS422",1000000,"RS422",1000000,"RS422",1000000,"RS422",1000000,"RS422",1000000,"RS422",1000000,"RS422",1000000,"RS422",1000000,"RS422",1000000,"RS422",1000000,"RS422",1000000,"RS422",1000000,"RS422",1000000,"RS422",1000000,"RS422",1000000,"RS422",1000000,"RS422",1000000,"RS422",1000000,"RS422",1000000,"RS422",1000000,"RS422",1000000,"RS422",1000000,"RS422",1000000,"RS422",1000000,"RS422",1000000,"RS422",1000000,"RS422",1000000,"RS422",1000000,"RS422",1000000,"RS422",1000000,"RS422",1000000,"RS422",1000000,"RS422",1000000,"RS422",1000000,"RS422",1000000,"RS422",1000000,"RS422",1000000,"RS422",1000000,"RS422",1000000,"RS422",1000000,"RS422",1000000,"RS422",1000000,"RS422",1000000,"RS422",1000000,"RS422",1000000,"RS422",1000000,"RS422",1000000,"RS422",1000000,"RS422",1000000,"RS422",1000000,"RS422",1000000,"RS422",1000000,"RS422",1000000,"RS422",1000000,"RS422",1000000,"RS422",1000000,"RS422",1000000,"RS422",1000000,"RS422",1000000,"RS422",1000000,"RS422",1000000,"RS422",1000000,"RS422",1000000,"RS422",1000000,"RS422",1000000,"RS422",1000000,"RS422",1000000,"RS422",1000000,"RS422",1000000,"RS422",1000000,"RS422",1000000,"RS422",1000000,"RS422",1000000,"RS422",1000000,"RS422",1000000,"RS422",1000000,"RS422",1000000,"RS422",1000000,"RS422",1000000,"RS422",1000000,"RS422",1000000,"RS422",1000000,"RS422",1000000,"RS422",1000000,"RS422",1000000,"RS422",1000000,"RS422",1000000,"RS422",1000000,"RS422",1000000,"RS422",1000000,"RS422",1000000,"RS422",1000000,"RS422",1000000,"RS422",1000000,"RS422",1000000,"RS422",1000000,"RS422",1000000,"RS422",1000000,"RS422",1000000,"RS422",1000000,"RS422",1000000,"RS422",1000000,"RS422",1000000,"RS422",1000000,"RS422",1000000,"RS422",1000000,"RS422",1000000,"RS422",1000000,"RS422",1000000,"RS422",1000000,"RS422",1000000,"RS422",1000000,"RS422",1000000,"RS422",1000000,"RS422",1000000,"RS422",1000000,"RS422",1000000,"RS422",1000000,"RS422",1000000,"RS422",1000000,"RS422",1000000,"RS422",1000000,"RS422",1000000,"RS422",1000000,"RS422",1000000,"RS422",1000000,"RS422",1000000,"RS422",1000000,"RS422",1000000,"RS422",1000000,"RS422",1000000,"RS422",1000000,"RS422",1000000,"RS422",1000000,"RS422",1000000,"RS422",1000000,"RS422",1000000,"RS422",1000000,"RS422",1000000,"RS422",1000000,"RS422",1000000,"RS422",1000000,"RS422",1000000,"RS422",1000000,"RS422",1000000,"RS422",1000000,"RS422",1000000,"RS422",1000000,"RS422",1000000,"RS422",1000000,"RS422",1000000,"RS422",1000000,"RS422",1000000,"RS422",1000000,"RS422",1000000,"RS422",1000000,"RS422",1000000,"RS422",1000000,"RS422",1000000,"RS422",1000000,"RS422",1000000,"RS422",1000000,"RS422",1000000,"RS422",1000000,"RS422",1000000,"RS422",1000000,"RS422",1000000,"RS422",1000000,"RS422",1000000,"RS422",1000000,"RS422",1000000,"RS422",1000000,"RS422",1000000,"RS422",1000000,"RS422",1000000,"RS422",1000000,"RS422",1000000,"RS422",1000000,"RS422",1000000,"RS422",1000000,"RS422",1000000,"RS422",1000000,"RS422",1000000,"RS422",1000000,"RS422",1000000,"RS422",1000000,"RS422",1000000,"RS422",1000000,"RS422",1000000,"RS422",1000000,"RS422",1000000,"RS422",1000000,"RS422",1000000,"RS422",1000000,"RS422",1000000,"RS422",1000000,"RS422",1000000,"RS422",1000000,"RS422",1000000,"RS422",1000000,"RS422",1000000,"RS422",1000000,"RS422",1000000,"RS422",1000000,"RS422",1000000,"RS422",1000000,"RS422",1000000,"RS422",1000000,"RS422",1000000,"RS422",1000000,"RS422",1000000,"RS422",1000000,"RS422",1000000,"RS422",1000000,"RS422",1000000,"RS422",1000000,"RS422",1000000,"RS422",1000000,"RS422",1000000,"RS422",1000000,"RS422",1000000,"RS422",1000000,"RS422",1000000,"RS422",1000000,"RS422",1000000,"RS422",1000000,"RS422",1000000,"RS422",1000000,"RS422",1000000,"RS422",1000000,"RS422",1000000,"RS422",1000000,"RS422",1000000,"RS422",1000000,"RS422",1000000,"RS422",1000000,"RS422",1000000,"RS422",1000000,"RS422",1000000,"RS422",1000000,"RS422",1000000,"RS422",1000000,"RS422",1000000,"RS422",1000000,"RS422",1000000,"RS422",1000000,"RS422",1000000,"RS422",1000000,"RS422",1000000,"RS422",1000000,"RS422",1000000,"RS422",1000000,"RS422",1000000,"RS422",1000000,"RS422",1000000,"RS422",1000000,"RS422",1000000,"RS422",1000000,"RS422",1000000,"RS422",1000000,"RS422",1000000,"RS422",1000000,"RS422",1000000,"RS422",1000000,"RS422",1000000,"RS422",1000000,"RS422",1000000,"RS422",1000000,"RS422",1000000,"RS422",1000000,"RS422",1000000,"RS422",1000000,"RS422",1000000,"RS422",1000000,"RS422",1000000,"RS422",1000000,"RS422",1000000,"RS422",1000000,"RS422",1000000,"RS422",1000000,"RS422",1000000,"RS422",1000000,"RS422",1000000,"RS422",1000000,"RS422",1000000,"RS422",1000000,"RS422",1000000,"RS422",1000000,"RS422",1000000,"RS422",1000000,"RS422",1000000,"RS422",1000000,"RS422",1000000,"RS422",1000000,"RS422",1000000,"RS422",1000000,"RS422",1000000,"RS422",1000000,"RS422",1000000,"RS422",1000000,"RS422",1000000,"RS422",1000000,"RS422",1000000,"RS422",1000000,"RS422",1000000,"RS422",1000000,"RS422",1000000,"RS422",1000000,"RS422",1000000,"RS422",1000000,"RS422",1000000,"RS422",1000000,"RS422",1000000,"RS422",1000000,"RS422",1000000,"RS422",1000000,"RS422",1000000,"RS422",1000000,"RS422",1000000,"RS422",1000000,"RS422",1000000,"RS422",1000000,"RS422",1000000,"RS422",1000000,"RS422",1000000,"RS422",1000000,"RS422",1000000,"RS422",1000000,"RS422",1000000,"RS422",1000000,"RS422",1000000,"RS422",1000000,"RS422",1000000,"RS422",1000000,"RS422",1000000,"RS422",1000000,"RS422",1000000,"RS422",1000000,"RS422",1000000,"RS422",1000000,"RS422",1000000,"RS422",1000000,"RS422",1000000,"RS422",1000000,"RS422",1000000,"RS422",1000000,"RS422",1000000,"RS422",1000000,"RS422",1000000,"RS422",1000000,"RS422",1000000,"RS422",1000000,"RS422",1000000,"RS422",1000000,"RS422",1000000,"RS422",1000000,"RS422",1000000,"RS422",1000000,"RS422",1000000,"RS422",1000000,"RS422",1000000,"RS422",1000000,"RS422",1000000,"RS422",1000000,"RS422",1000000,"RS422",1000000,"RS422",1000000,"RS422",1000000,"RS422",1000000,"RS422",1000000,"RS422",1000000,"RS422",1000000,"RS422",1000000,"RS422",1000000,"RS422",1000000,"RS422",1000000,"RS422",1000000,"RS422",1000000,"RS422",1000000,"RS422",1000000,"RS422",1000000,"RS422",1000000,"RS422",1000000,"RS422",1000000,"RS422",1000000,"RS422",1000000,"RS422",1000000,"RS422",1000000,"RS422",1000000,"RS422",1000000,"RS422",1000000,"RS422",1000000,"RS422",1000000,"RS422",1000000,"RS422",1000000,"RS422",1000000,"RS422",1000000,"RS422",1000000,"RS422",1000000,"RS422",1000000,"RS422",1000000,"RS422",1000000,"RS422",1000000,"RS422",1000000,"RS422",1000000,"RS422",1000000,"RS422",1000000,"RS422",1000000,"RS422",1000000,"RS422",1000000,"RS422",1000000,"RS422",1000000,"RS422",1000000,"RS422",1000000,"RS422",1000000,"RS422",1000000,"RS422",1000000,"RS422",1000000,"RS422",1000000,"RS422",1000000,"RS422",1000000,"RS422",1000000,"RS422",1000000,"RS422",1000000,"RS422",1000000,"RS422",1000000,"RS422",1000000,"RS422",1000000,"RS422",1000000,"RS422",1000000,"RS422",1000000,"RS422",1000000,"RS422",1000000,"RS422",1000000,"RS422",1000000,"RS422",1000000,"RS422",1000000,"RS422",1000000,"RS422",1000000,"RS422",1000000,"RS422",1000000,"RS422",1000000,"RS422",1000000,"RS422",1000000,"RS422",1000000,"RS422",1000000,"RS422",1000000,"RS422",1000000,"RS422",1000000,"RS422",1000000,"RS422",1000000,"RS422",1000000,"RS422",1000000,"RS422",1000000,"RS422",1000000,"RS422",1000000,"RS422",1000000,"RS422",1000000,"RS422",1000000,"RS422",1000000,"RS422",1000000,"RS422",1000000,"RS422",1000000,"RS422",1000000]
["RS485",1000000,"MIL-STD-1553",1000000,null,null,"MIL-STD-1553",1000000,"MIL-STD-1553",1000000,"MIL-STD-1553",1000000,"MIL-STD-1553",1000000,"MIL-STD-1553",1000000,"MIL-STD-1553",1000000,"MIL-STD-1553",1000000,"MIL-STD-1553",1000000,"MIL-STD-1553",1000000,"MIL-STD-1553",1000000,"MIL-STD-1553",1000000,"MIL-STD-1553",1000000,"MIL-STD-1553",1000000,"MIL-STD-1553",1000000,"MIL-STD-1553",1000000,"MIL-STD-1553",1000000,"MIL-STD-1553",1000000,"MIL-STD-1553",1000000,"MIL-STD-1553",1000000,"MIL-STD-1553",1000000,"MIL-STD-1553",1000000,"MIL-STD-1553",1000000,"MIL-STD-1553",1000000,"MIL-STD-1553",1000000,"MIL-STD-1553",1000000,"MIL-STD-1553",1000000,"MIL-STD-1553",1000000,"MIL-STD-1553",1000000,"MIL-STD-1553",1000000,"MIL-STD-1553",1000000,"MIL-STD-1553",1000000,"MIL-STD-1553",1000000,"MIL-STD-1553",1000000,"MIL-STD-1553",1000000,"MIL-STD-1553",1000000,"MIL-STD-1553",1000000,"MIL-STD-1553",1000000,"MIL-STD-1553",1000000,"MIL-STD-1553",1000000,"MIL-STD-1553",1000000,"MIL-STD-1553",1000000,"MIL-STD-1553",1000000,"MIL-STD-1553",1000000,"MIL-STD-1553",1000000,"MIL-STD-1553",1000000,"MIL-STD-1553",1000000,"MIL-STD-1553",1000000,"MIL-STD-1553",1000000,"MIL-STD-1553",1000000,"MIL-STD-1553",1000000,"MIL-STD-1553",1000000,"MIL-STD-1553",1000000,"MIL-STD-1553",1000000,"MIL-STD-1553",1000000,"MIL-STD-1553",1000000,"MIL-STD-1553",1000000,"MIL-STD-1553",1000000,"MIL-STD-1553",1000000,"MIL-STD-1553",1000000,"MIL-STD-1553",1000000,"MIL-STD-1553",1000000,"MIL-STD-1553",1000000,"MIL-STD-1553",1000000,"MIL-STD-1553",1000000,"MIL-STD-1553",1000000,"MIL-STD-1553",1000000,"MIL-STD-1553",1000000,"MIL-STD-1553",1000000,"MIL-STD-1553",1000000,"MIL-STD-1553",1000000,"MIL-STD-1553",1000000,"MIL-STD-1553",1000000,"MIL-STD-1553",1000000,"MIL-STD-1553",1000000,"MIL-STD-1553",1000000,"MIL-STD-1553",1000000,"MIL-STD-1553",1000000,"MIL-STD-1553",1000000,"MIL-STD-1553",1000000,"MIL-STD-1553",1000000,"MIL-STD-1553",1000000,"MIL-STD-1553",1000000,"MIL-STD-1553",1000000,"MIL-STD-1553",1000000,"MIL-STD-1553",1000000,"MIL-STD-1553",1000000,"MIL-STD-1553",1000000,"MIL-STD-1553",1000000,"MIL-STD-1553",1000000,"MIL-STD-1553",1000000,"MIL-STD-1553",1000000,"MIL-STD-1553",1000000,"MIL-STD-1553",1000000,"MIL-STD-1553",1000000,"MIL-STD-1553",1000000,"MIL-STD-1553",1000000,"MIL-STD-1553",1000000,"MIL-STD-1553",1000000,"MIL-STD-1553",1000000,"MIL-STD-1553",1000000,"MIL-STD-1553",1000000,"MIL-STD-1553",1000000,"MIL-STD-1553",1000000,"MIL-STD-1553",1000000,"MIL-STD-1553",1000000,"MIL-STD-1553",1000000,"MIL-STD-1553",1000000,"MIL-STD-1553",1000000,"MIL-STD-1553",1000000,"MIL-STD-1553",1000000,"MIL-STD-1553",1000000,"MIL-STD-1553",1000000,"MIL-STD-1553",1000000,"MIL-STD-1553",1000000,"MIL-STD-1553",1000000,"MIL-STD-1553",1000000,"MIL-STD-1553",1000000,"MIL-STD-1553",1000000,"MIL-STD-1553",1000000,"MIL-STD-1553",1000000,"MIL-STD-1553",1000000,"MIL-STD-1553",1000000,"MIL-STD-1553",1000000,"MIL-STD-1553",1000000,"MIL-STD-1553",1000000,"MIL-STD-1553",1000000,"MIL-STD-1553",1000000,"MIL-STD-1553",1000000,"MIL-STD-1553",1000000,"MIL-STD-1553",1000000,"MIL-STD-1553",1000000,"MIL-STD-1553",1000000,"MIL-STD-1553",1000000,"MIL-STD-1553",1000000,"MIL-STD-1553",1000000,"MIL-STD-1553",1000000,"MIL-STD-1553",1000000,"MIL-STD-1553",1000000,"MIL-STD-1553",1000000,"MIL-STD-1553",1000000,"MIL-STD-1553",1000000,"MIL-STD-1553",1000000,"MIL-STD-1553",1000000,"MIL-STD-1553",1000000,"MIL-STD-1553",1000000,"MIL-STD-1553",1000000,"MIL-STD-1553",1000000,"MIL-STD-1553",1000000,"MIL-STD-1553",1000000,"MIL-STD-1553",1000000,"MIL-STD-1553",1000000,"MIL-STD-1553",1000000,"MIL-STD-1553",1000000,"MIL-STD-1553",1000000,"MIL-STD-1553",1000000,"MIL-STD-1553",1000000,"MIL-STD-1553",1000000,"MIL-STD-1553",1000000,"MIL-STD-1553",1000000,"MIL-STD-1553",1000000,"MIL-STD-1553",1000000,"MIL-STD-1553",1000000,"MIL-STD-1553",1000000,"MIL-STD-1553",1000000,"MIL-STD-1553",1000000,"MIL-STD-1553",1000000,"MIL-STD-1553",1000000,"MIL-STD-1553",1000000,"MIL-STD-1553",1000000,"MIL-STD-1553",1000000,"MIL-STD-1553",1000000,"MIL-STD-1553",1000000,"MIL-STD-1553",1000000,"MIL-STD-1553",1000000,"MIL-STD-1553",1000000,"MIL-STD-1553",1000000,"MIL-STD-1553",1000000,"MIL-STD-1553",1000000,"MIL-STD-1553",1000000,"MIL-STD-1553",1000000,"MIL-STD-1553",1000000,"MIL-STD-1553",1000000,"MIL-STD-1553",1000000,"MIL-STD-1553",1000000,"MIL-STD-1553",1000000,"MIL-STD-1553",1000000,"MIL-STD-1553",1000000,"MIL-STD-1553",1000000,"MIL-STD-1553",1000000,"MIL-STD-1553",1000000,"MIL-STD-1553",1000000,"MIL-STD-1553",1000000,"MIL-STD-1553",1000000,"MIL-STD-1553",1000000,"MIL-STD-1553",1000000,"MIL-STD-1553",1000000,"MIL-STD-1553",1000000,"MIL-STD-1553",1000000,"MIL-STD-1553",1000000,"MIL-STD-1553",1000000,"MIL-STD-1553",1000000,"MIL-STD-1553",1000000,"MIL-STD-1553",1000000,"MIL-STD-1553",1000000,"MIL-STD-1553",1000000,"MIL-STD-1553",1000000,"MIL-STD-1553",1000000,"MIL-STD-1553",1000000,"MIL-STD-1553",1000000,"MIL-STD-1553",1000000,"MIL-STD-1553",1000000,"MIL-STD-1553",1000000,"MIL-STD-1553",1000000,"MIL-STD-1553",1000000,"MIL-STD-1553",1000000,"MIL-STD-1553",1000000,"MIL-STD-1553",1000000,"MIL-STD-1553",1000000,"MIL-STD-1553",1000000,"MIL-STD-1553",1000000,"MIL-STD-1553",1000000,"MIL-STD-1553",1000000,"MIL-STD-1553",1000000,"MIL-STD-1553",1000000,"MIL-STD-1553",1000000,"MIL-STD-1553",1000000,"MIL-STD-1553",1000000,"MIL-STD-1553",1000000,"MIL-STD-1553",1000000,"MIL-STD-1553",1000000,"MIL-STD-1553",1000000,"MIL-STD-1553",1000000,"MIL-STD-1553",1000000,"MIL-STD-1553",1000000,"MIL-STD-1553",1000000,"MIL-STD-1553",1000000,"MIL-STD-1553",1000000,"MIL-STD-1553",1000000,"MIL-STD-1553",1000000,"MIL-STD-1553",1000000,"MIL-STD-1553",1000000,"MIL-STD-1553",1000000,"MIL-STD-1553",1000000,"MIL-STD-1553",1000000,"MIL-STD-1553",1000000,"MIL-STD-1553",1000000,"MIL-STD-1553",1000000,"MIL-STD-1553",1000000,"MIL-STD-1553",1000000,"MIL-STD-1553",1000000,"MIL-STD-1553",1000000,"MIL-STD-1553",1000000,"MIL-STD-1553",1000000,"MIL-STD-1553",1000000,"MIL-STD-1553",1000000,"MIL-STD-1553",1000000,"MIL-STD-1553",1000000,"MIL-STD-1553",1000000,"MIL-STD-1553",1000000,"MIL-STD-1553",1000000,"MIL-STD-1553",1000000,"MIL-STD-1553",1000000,"MIL-STD-1553",1000000,"MIL-STD-1553",1000000,"MIL-STD-1553",1000000,"MIL-STD-1553",1000000,"MIL-STD-1553",1000000,"MIL-STD-1553",1000000,"MIL-STD-1553",1000000,"MIL-STD-1553",1000000,"MIL-STD-1553",1000000,"MIL-STD-1553",1000000,"MIL-STD-1553",1000000,"MIL-STD-1553",1000000,"MIL-STD-1553",1000000,"MIL-STD-1553",1000000,"MIL-STD-1553",1000000,"MIL-STD-1553",1000000,"MIL-STD-1553",1000000,"MIL-STD-1553",1000000,"MIL-STD-1553",1000000,"MIL-STD-1553",1000000,"MIL-STD-1553",1000000,"MIL-STD-1553",1000000,"MIL-STD-1553",1000000,"MIL-STD-1553",1000000,"MIL-STD-1553",1000000,"MIL-STD-1553",1000000,"MIL-STD-1553",1000000,"MIL-STD-1553",1000000,"MIL-STD-1553",1000000,"MIL-STD-1553",1000000,"MIL-STD-1553",1000000,"MIL-STD-1553",1000000,"MIL-STD-1553",1000000,"MIL-STD-1553",1000000,"MIL-STD-1553",1000000,"MIL-STD-1553",1000000,"MIL-STD-1553",1000000,"MIL-STD-1553",1000000,"MIL-STD-1553",1000000,"MIL-STD-1553",1000000,"MIL-STD-1553",1000000,"MIL-STD-1553",1000000,"MIL-STD-1553",1000000,"MIL-STD-1553",1000000,"MIL-STD-1553",1000000,"MIL-STD-1553",1000000,"MIL-STD-1553",1000000,"MIL-STD-1553",1000000,"MIL-STD-1553",1000000,"MIL-STD-1553",1000000,"MIL-STD-1553",1000000,"MIL-STD-1553",1000000,"MIL-STD-1553",1000000,"MIL-STD-1553",1000000,"MIL-STD-1553",1000000,"MIL-STD-1553",1000000,"MIL-STD-1553",1000000,"MIL-STD-1553",1000000,"MIL-STD-1553",1000000,"MIL-STD-1553",1000000,"MIL-STD-1553",1000000,"MIL-STD-1553",1000000,"MIL-STD-1553",1000000,"MIL-STD-1553",1000000,"MIL-STD-1553",1000000,"MIL-STD-1553",1000000,"MIL-STD-1553",1000000,"MIL-STD-1553",1000000,"MIL-STD-1553",1000000,"MIL-STD-1553",1000000,"MIL-STD-1553",1000000,"MIL-STD-1553",1000000,"MIL-STD-1553",1000000,"MIL-STD-1553",1000000,"MIL-STD-1553",1000000,"MIL-STD-1553",1000000,"MIL-STD-1553",1000000,"MIL-STD-1553",1000000,"MIL-STD-1553",1000000,"MIL-STD-1553",1000000,"MIL-STD-1553",1000000,"MIL-STD-1553",1000000,"MIL-STD-1553",1000000,"MIL-STD-1553",1000000,"MIL-STD-1553",1000000,"MIL-STD-1553",1000000,"MIL-STD-1553",1000000,"MIL-STD-1553",1000000,"MIL-STD-1553",1000000,"MIL-STD-1553",1000000,"MIL-STD-1553",1000000,"MIL-STD-1553",1000000,"MIL-STD-1553",1000000,"MIL-STD-1553",1000000,"MIL-STD-1553",1000000,"MIL-STD-1553",1000000,"MIL-STD-1553",1000000,"MIL-STD-1553",1000000,"MIL-STD-1553",1000000,"MIL-STD-1553",1000000,"MIL-STD-1553",1000000,"MIL-STD-1553",1000000,"MIL-STD-1553",1000000,"MIL-STD-1553",1000000,"MIL-STD-1553",1000000,"MIL-STD-1553",1000000,"MIL-STD-1553",1000000,"MIL-STD-1553",1000000,"MIL-STD-1553",1000000,"MIL-STD-1553",1000000,"MIL-STD-1553",1000000,"MIL-STD-1553",1000000,"MIL-STD-1553",1000000,"MIL-STD-1553",1000000,"MIL-STD-1553",1000000,"MIL-STD-1553",1000000,"MIL-STD-1553",1000000,"MIL-STD-1553",1000000,"MIL-STD-1553",1000000,"MIL-STD-1553",1000000,"MIL-STD-1553",1000000,"MIL-STD-1553",1000000,"MIL-STD-1553",1000000,"MIL-STD-1553",1000000,"MIL-STD-1553",1000000,"MIL-STD-1553",1000000,"MIL-STD-1553",1000000,"MIL-STD-1553",1000000,"MIL-STD-1553",1000000,"MIL-STD-1553",1000000,"MIL-STD-1553",1000000,"MIL-STD-1553",1000000,"MIL-STD-1553",1000000,"MIL-STD-1553",1000000,"MIL-STD-1553",1000000,"MIL-STD-1553",1000000,"MIL-STD-1553",1000000,"MIL-STD-1553",1000000,"MIL-STD-1553",1000000,"MIL-STD-1553",1000000,"MIL-STD-1553",1000000,"MIL-STD-1553",1000000,"MIL-STD-1553",1000000,"MIL-STD-1553",1000000,"MIL-STD-1553",1000000,"MIL-STD-1553",1000000,"MIL-STD-1553",1000000,"MIL-STD-1553",1000000,"MIL-STD-1553",1000000,"MIL-STD-1553",1000000,"MIL-STD-1553",1000000,"MIL-STD-1553",1000000,"MIL-STD-1553",1000000,"MIL-STD-1553",1000000,"MIL-STD-1553",1000000,"MIL-STD-1553",1000000,"MIL-STD-1553",1000000,"MIL-STD-1553",1000000,"MIL-STD-1553",1000000,"MIL-STD-1553",1000000,"MIL-STD-1553",1000000,"MIL-STD-1553",1000000,"MIL-STD-1553",1000000,"MIL-STD-1553",1000000,"MIL-STD-1553",1000000,"MIL-STD-1553",1000000,"MIL-STD-1553",1000000,"MIL-STD-1553",1000000,"MIL-STD-1553",1000000,"MIL-STD-1553",1000000,"MIL-STD-1553",1000000,"MIL-STD-1553",1000000,"MIL-STD-1553",1000000,"MIL-STD-1553",1000000,"MIL-STD-1553",1000000,"MIL-STD-1553",1000000,"MIL-STD-1553",1000000,"MIL-STD-1553",1000000,"MIL-STD-1553",1000000,"MIL-STD-1553",1000000,"MIL-STD-1553",1000000,"MIL-STD-1553",1000000,"MIL-STD-1553",1000000,"MIL-STD-1553",1000000,"MIL-STD-1553",1000000,"MIL-STD-1553",1000000,"MIL-STD-1553",1000000,"MIL-STD-1553",1000000,"MIL-STD-1553",1000000,"MIL-STD-1553",1000000,"MIL-STD-1553",1000000,"MIL-STD-1553",1000000,"MIL-STD-1553",1000000,"MIL-STD-1553",1000000,"MIL-STD-1553",1000000,"MIL-STD-1553",1000000,"MIL-STD-1553",1000000,"MIL-STD-1553",1000000,"MIL-STD-1553",1000000,"MIL-STD-1553",1000000,"MIL-STD-1553",1000000,"MIL-STD-1553",1000000,"MIL-STD-1553",1000000,"MIL-STD-1553",1000000,"MIL-STD-1553",1000000,"MIL-STD-1553",1000000,"MIL-STD-1553",1000000,"MIL-STD-1553",1000000,"MIL-STD-1553",1000000,"MIL-STD-1553",1000000,"MIL-STD-1553",1000000,"MIL-STD-1553",1000000,"MIL-STD-1553",1000000,"MIL-STD-1553",1000000,"MIL-STD-1553",1000000,"MIL-STD-1553",1000000,"MIL-STD-1553",1000000,"MIL-STD-1553",1000000,"MIL-STD-1553",1000000,"MIL-STD-1553",1000000,"MIL-STD-1553",1000000,"MIL-STD-1553",1000000,"MIL-STD-1553",1000000,"MIL-STD-1553",1000000,"MIL-STD-1553",1000000,"MIL-STD-1553",1000000,"MIL-STD-1553",1000000,"MIL-STD-1553",1000000,"MIL-STD-1553",1000000,"MIL-STD-1553",1000000,"MIL-STD-1553",1000000,"MIL-STD-1553",1000000,"MIL-STD-1553",1000000,"MIL-STD-1553",1000000,"MIL-STD-1553",1000000,"MIL-STD-1553",1000000,"MIL-STD-1553",1000000,"MIL-STD-1553",1000000,"MIL-STD-1553",1000000,"MIL-STD-1553",1000000,"MIL-STD-1553",1000000,"MIL-STD-1553",1000000,"MIL-STD-1553",1000000,"MIL-STD-1553",1000000,"MIL-STD-1553",1000000,"MIL-STD-1553",1000000,"MIL-STD-1553",1000000,"MIL-STD-1553",1000000,"MIL-STD-1553",1000000,"MIL-STD-1553",1000000,"MIL-STD-1553",1000000,"MIL-STD-1553",1000000,"MIL-STD-1553",1000000,"MIL-STD-1553",1000000,"MIL-STD-1553",1000000,"MIL-STD-1553",1000000,"MIL-STD-1553",1000000,"MIL-STD-1553",1000000,"MIL-STD-1553",1000000,"MIL-STD-1553",1000000,"MIL-STD-1553",1000000,"MIL-STD-1553",1000000,"MIL-STD-1553",1000000,"MIL-STD-1553",1000000,"MIL-STD-1553",1000000,"MIL-STD-1553",1000000,"MIL-STD-1553",1000000,"MIL-STD-1553",1000000,"MIL-STD-1553",1000000,"MIL-STD-1553",1000000,"MIL-STD-1553",1000000,"MIL-STD-1553",1000000,"MIL-STD-1553",1000000,"MIL-STD-1553",1000000,"MIL-STD-1553",1000000,"MIL-STD-1553",1000000,"MIL-STD-1553",1000000,"MIL-STD-1553",1000000,"MIL-STD-1553",1000000,"MIL-STD-1553",1000000,"MIL-STD-1553",1000000,"MIL-STD-1553",1000000,"MIL-STD-1553",1000000,"MIL-STD-1553",1000000,"MIL-STD-1553",1000000,"MIL-STD-1553",1000000,"MIL-STD-1553",1000000,"MIL-STD-1553",1000000,"MIL-STD-1553",1000000,"MIL-STD-1553",1000000,"MIL-STD-1553",1000000,"MIL-STD-1553",1000000,"MIL-STD-1553",1000000,"MIL-STD-1553",1000000,"MIL-STD-1553",1000000,"MIL-STD-1553",1000000,"MIL-STD-1553",1000000,"MIL-STD-1553",1000000,"MIL-STD-1553",1000000,"MIL-STD-1553",1000000,"MIL-STD-1553",1000000,"MIL-STD-1553",1000000,"MIL-STD-1553",1000000,"MIL-STD-1553",1000000,"MIL-STD-1553",1000000,"MIL-STD-1553",1000000,"MIL-STD-1553",1000000,"MIL-STD-1553",1000000,"MIL-STD-1553",1000000,"MIL-STD-1553",1000000,"MIL-STD-1553",1000000,"MIL-STD-1553",1000000,"MIL-STD-1553",1000000,"MIL-STD-1553",1000000,"MIL-STD-1553",1000000,"MIL-STD-1553",1000000,"MIL-STD-1553",1000000,"MIL-STD-1553",1000000,"MIL-STD-1553",1000000,"MIL-STD-1553",1000000,"MIL-STD-1553",1000000,"MIL-STD-1553",1000000,"MIL-STD-1553",1000000,"MIL-STD-1553",1000000,"MIL-STD-1553",1000000,"MIL-STD-1553",1000000,"MIL-STD-1553",1000000,"MIL-STD-1553",1000000,"MIL-STD-1553",1000000,"MIL-STD-1553",1000000,"MIL-STD-1553",1000000,"MIL-STD-1553",1000000,"MIL-STD-1553",1000000,"MIL-STD-1553",1000000,"MIL-STD-1553",1000000,"MIL-STD-1553",1000000,"MIL-STD-1553",1000000,"MIL-STD-1553",1000000,"MIL-STD-1553",1000000,"MIL-STD-1553",1000000,"MIL-STD-1553",1000000,"MIL-STD-1553",1000000,"MIL-STD-1553",1000000,"MIL-STD-1553",1000000,"MIL-STD-1553",1000000,"MIL-STD-1553",1000000,"MIL-STD-1553",1000000,"MIL-STD-1553",1000000,"MIL-STD-1553",1000000,"MIL-STD-1553",1000000,"MIL-STD-1553",1000000,"MIL-STD-1553",1000000,"MIL-STD-1553",1000000,"MIL-STD-1553",1000000,"MIL-STD-1553",1000000,"MIL-STD-1553",1000000,"MIL-STD-1553",1000000,"MIL-STD-1553",1000000,"MIL-STD-1553",1000000,"MIL-STD-1553",1000000,"MIL-STD-1553",1000000,"MIL-STD-1553",1000000,"MIL-STD-1553",1000000,"MIL-STD-1553",1000000,"MIL-STD-1553",1000000,"MIL-STD-1553",1000000,"MIL-STD-1553",1000000,"MIL-STD-1553",1000000,"MIL-STD-1553",1000000,"MIL-STD-1553",1000000,"MIL-STD-1553",1000000,"MIL-STD-1553",1000000,"MIL-STD-1553",1000000,"MIL-STD-1553",1000000,"MIL-STD-1553",1000000,"MIL-STD-1553",1000000,"MIL-STD-1553",1000000,"MIL-STD-1553",1000000,"MIL-STD-1553",1000000,"MIL-STD-1553",1000000,"MIL-STD-1553",1000000,"MIL-STD-1553",1000000,"MIL-STD-1553",1000000,"MIL-STD-1553",1000000,"MIL-STD-1553",1000000,"MIL-STD-1553",1000000,"MIL-STD-1553",1000000,"MIL-STD-1553",1000000,"MIL-STD-1553",1000000,"MIL-STD-1553",1000000,"MIL-STD-1553",1000000,"MIL-STD-1553",1000000,"MIL-STD-1553",1000000,"MIL-STD-1553",1000000,"MIL-STD-1553",1000000,"MIL-STD-1553",1000000,"MIL-STD-1553",1000000,"MIL-STD-1553",1000000,"MIL-STD-1553",1000000,"MIL-STD-1553",1000000,"MIL-STD-1553",1000000,"MIL-STD-1553",1000000,"MIL-STD-1553",1000000,"MIL-STD-1553",1000000,"MIL-STD-1553",1000000,"MIL-STD-1553",1000000,"MIL-STD-1553",1000000,"MIL-STD-1553",1000000,"MIL-STD-1553",1000000,"MIL-STD-1553",1000000,"MIL-STD-1553",1000000,"MIL-STD-1553",1000000,"MIL-STD-1553",1000000,"MIL-STD-1553",1000000,"MIL-STD-1553",1000000,"MIL-STD-1553",1000000,"MIL-STD-1553",1000000,"MIL-STD-1553",1000000,"MIL-STD-1553",1000000,"MIL-STD-1553",1000000,"MIL-STD-1553",1000000,"MIL-STD-1553",1000000,"MIL-STD-1553",1000000,"MIL-STD-1553",1000000,"MIL-STD-1553",1000000,"MIL-STD-1553",1000000,"MIL-STD-1553",1000000,"MIL-STD-1553",1000000,"MIL-STD-1553",1000000,"MIL-STD-1553",1000000,"MIL-STD-1553",1000000,"MIL-STD-1553",1000000,"MIL-STD-1553",1000000,"MIL-STD-1553",1000000,"MIL-STD-1553",1000000,"MIL-STD-1553",1000000,"MIL-STD-1553",1000000,"MIL-STD-1553",1000000,"MIL-STD-1553",1000000,"MIL-STD-1553",1000000,"MIL-STD-1553",1000000,"MIL-STD-1553",1000000,"MIL-STD-1553",1000000,"MIL-STD-1553",1000000,"MIL-STD-1553",1000000,"MIL-STD-1553",1000000,"MIL-STD-1553",1000000,"MIL-STD-1553",1000000,"MIL-STD-1553",1000000,"MIL-STD-1553",1000000,"MIL-STD-1553",1000000,"MIL-STD-1553",1000000,"MIL-STD-1553",1000000,"MIL-STD-1553",1000000,"MIL-STD-1553",1000000,"MIL-STD-1553",1000000,"MIL-STD-1553",1000000,"MIL-STD-1553",1000000,"MIL-STD-1553",1000000,"MIL-STD-1553",1000000,"MIL-STD-1553",1000000,"MIL-STD-1553",1000000,"MIL-STD-1553",1000000,"MIL-STD-1553",1000000,"MIL-STD-1553",1000000,"MIL-STD-1553",1000000,"MIL-STD-1553",1000000,"MIL-STD-1553",1000000,"MIL-STD-1553",1000000,"MIL-STD-1553",1000000,"MIL-STD-1553",1000000,"MIL-STD-1553",1000000,"MIL-STD-1553",1000000,"MIL-STD-1553",1000000,"MIL-STD-1553",1000000,"MIL-STD-1553",1000000,"MIL-STD-1553",1000000,"MIL-STD-1553",1000000,"MIL-STD-1553",1000000,"MIL-STD-1553",1000000,"MIL-STD-1553",1000000,"MIL-STD-1553",1000000,"MIL-STD-1553",1000000,"MIL-STD-1553",1000000,"MIL-STD-1553",1000000,"MIL-STD-1553",1000000,"MIL-STD-1553",1000000,"MIL-STD-1553",1000000,"MIL-STD-1553",1000000,"MIL-STD-1553",1000000,"MIL-STD-1553",1000000,"MIL-STD-1553",1000000,"MIL-STD-1553",1000000,"MIL-STD-1553",1000000,"MIL-STD-1553",1000000,"MIL-STD-1553",1000000,"MIL-STD-1553",1000000,"MIL-STD-1553",1000000,"MIL-STD-1553",1000000,"MIL-STD-1553",1000000,"MIL-STD-1553",1000000,"MIL-STD-1553",1000000,"MIL-STD-1553",1000000,"MIL-STD-1553",1000000,"MIL-STD-1553",1000000,"MIL-STD-1553",1000000,"MIL-STD-1553",1000000,"MIL-STD-1553",1000000,"MIL-STD-1553",1000000,"MIL-STD-1553",1000000,"MIL-STD-1553",1000000,"MIL-STD-1553",1000000,"MIL-STD-1553",1000000,"MIL-STD-1553",1000000,"MIL-STD-1553",1000000,"MIL-STD-1553",1000000,"MIL-STD-1553",1000000,"MIL-STD-1553",1000000,"MIL-STD-1553",1000000,"MIL-STD-1553",1000000,"MIL-STD-1553",1000000,"MIL-STD-1553",1000000,"MIL-STD-1553",1000000,"MIL-STD-1553",1000000,"MIL-STD-1553",1000000,"MIL-STD-1553",1000000,"MIL-STD-1553",1000000,"MIL-STD-1553",1000000,"MIL-STD-1553",1000000,"MIL-STD-1553",1000000,"MIL-STD-1553",1000000,"MIL-STD-1553",1000000,"MIL-STD-1553",1000000,"MIL-STD-1553",1000000,"MIL-STD-1553",1000000,"MIL-STD-1553",1000000,"MIL-STD-1553",1000000,"MIL-STD-1553",1000000,"MIL-STD-1553",1000000,"MIL-STD-1553",1000000,"MIL-STD-1553",1000000,"MIL-STD-1553",1000000,"MIL-STD-1553",1000000,"MIL-STD-1553",1000000,"MIL-STD-1553",1000000,"MIL-STD-1553",1000000,"MIL-STD-1553",1000000,"MIL-STD-1553",1000000,"MIL-STD-1553",1000000,"MIL-STD-1553",1000000,"MIL-STD-1553",1000000,"MIL-STD-1553",1000000,"MIL-STD-1553",1000000,"MIL-STD-1553",1000000,"MIL-STD-1553",1000000,"MIL-STD-1553",1000000,"MIL-STD-1553",1000000,"MIL-STD-1553",1000000,"MIL-STD-1553",1000000,"MIL-STD-1553",1000000,"MIL-STD-1553",1000000,"MIL-STD-1553",1000000,"MIL-STD-1553",1000000,"MIL-STD-1553",1000000,"MIL-STD-1553",1000000,"MIL-STD-1553",1000000,"MIL-STD-1553",1000000,"MIL-STD-1553",1000000,"MIL-STD-1553",1000000,"MIL-STD-1553",1000000,"MIL-STD-1553",1000000,"MIL-STD-1553",1000000,"MIL-STD-1553",1000000,"MIL-STD-1553",1000000,"MIL-STD-1553",1000000,"MIL-STD-1553",1000000,"MIL-STD-1553",1000000,"MIL-STD-1553",1000000,"MIL-STD-1553",1000000,"MIL-STD-1553",1000000,"MIL-STD-1553",1000000,"MIL-STD-1553",1000000,"MIL-STD-1553",1000000,"MIL-STD-1553",1000000,"MIL-STD-1553",1000000,"MIL-STD-1553",1000000,"MIL-STD-1553",1000000,"MIL-STD-1553",1000000,"MIL-STD-1553",1000000,"MIL-STD-1553",1000000,"MIL-STD-1553",1000000,"MIL-STD-1553",1000000,"MIL-STD-1553",1000000,"MIL-STD-1553",1000000,"MIL-STD-1553",1000000,"MIL-STD-1553",1000000,"MIL-STD-1553",1000000,"MIL-STD-1553",1000000,"MIL-STD-1553",1000000,"MIL-STD-1553",1000000,"MIL-STD-1553",1000000,"MIL-STD-1553",1000000,"MIL-STD-1553",1000000,"MIL-STD-1553",1000000,"MIL-STD-1553",1000000,"MIL-STD-1553",1000000,"MIL-STD-1553",1000000,"MIL-STD-1553",1000000,"MIL-STD-1553",1000000,"MIL-STD-1553",1000000,"MIL-STD-1553",1000000,"MIL-STD-1553",1000000,"MIL-STD-1553",1000000,"MIL-STD-1553",1000000,"MIL-STD-1553",1000000,"MIL-STD-1553",1000000,"MIL-STD-1553",1000000,"MIL-STD-1553",1000000,"MIL-STD-1553",1000000,"MIL-STD-1553",1000000,"MIL-STD-1553",1000000,"MIL-STD-1553",1000000,"MIL-STD-1553",1000000,"MIL-STD-1553",1000000,"MIL-STD-1553",1000000,"MIL-STD-1553",1000000,"MIL-STD-1553",1000000,"MIL-STD-1553",1000000,"MIL-STD-1553",1000000,"MIL-STD-1553",1000000,"MIL-STD-1553",1000000,"MIL-STD-1553",1000000,"MIL-STD-1553",1000000,"MIL-STD-1553",1000000,"MIL-STD-1553",1000000,"MIL-STD-1553",1000000,"MIL-STD-1553",1000000,"MIL-STD-1553",1000000,"MIL-STD-1553",1000000,"MIL-STD-1553",1000000,"MIL-STD-1553",1000000,"MIL-STD-1553",1000000,"MIL-STD-1553",1000000,"MIL-STD-1553",1000000,"MIL-STD-1553",1000000,"MIL-STD-1553",1000000,"MIL-STD-1553",1000000,"MIL-STD-1553",1000000,"MIL-STD-1553",1000000,"MIL-STD-1553",1000000,"MIL-STD-1553",1000000,"MIL-STD-1553",1000000,"MIL-STD-1553",1000000,"MIL-STD-1553",1000000,"MIL-STD-1553",1000000,"MIL-STD-1553",1000000,"MIL-STD-1553",1000000,"MIL-STD-1553",1000000,"MIL-STD-1553",1000000,"MIL-STD-1553",1000000,"MIL-STD-1553",1000000,"MIL-STD-1553",1000000,"MIL-STD-1553",1000000,"MIL-STD-1553",1000000,"MIL-STD-1553",1000000,"MIL-STD-1553",1000000,"MIL-STD-1553",1000000,"MIL-STD-1553",1000000,"MIL-STD-1553",1000000,"MIL-STD-1553",1000000,"MIL-STD-1553",1000000,"MIL-STD-1553",1000000,"MIL-STD-1553",1000000,"MIL-STD-1553",1000000,"MIL-STD-1553",1000000,"MIL-STD-1553",1000000,"MIL-STD-1553",1000000,"MIL-STD-1553",1000000,"MIL-STD-1553",1000000,"MIL-STD-1553",1000000,"MIL-STD-1553",1000000,"MIL-STD-1553",1000000,"MIL-STD-1553",1000000,"MIL-STD-1553",1000000,"MIL-STD-1553",1000000,"MIL-STD-1553",1000000,"MIL-STD-1553",1000000,"MIL-STD-1553",1000000,"MIL-STD-1553",1000000,"MIL-STD-1553",1000000,"MIL-STD-1553",1000000,"MIL-STD-1553",1000000,"MIL-STD-1553",1000000,"MIL-STD-1553",1000000,"MIL-STD-1553",1000000,"MIL-STD-1553",1000000,"MIL-STD-1553",1000000,"MIL-STD-1553",1000000,"MIL-STD-1553",1000000,"MIL-STD-1553",1000000,"MIL-STD-1553",1000000,"MIL-STD-1553",1000000,"MIL-STD-1553",1000000,"MIL-STD-1553",1000000,"MIL-STD-1553",1000000,"MIL-STD-1553",1000000,"MIL-STD-1553",1000000,"MIL-STD-1553",1000000,"MIL-STD-1553",1000000,"MIL-STD-1553",1000000,"MIL-STD-1553",1000000,"MIL-STD-1553",1000000,"MIL-STD-1553",1000000,"MIL-STD-1553",1000000,"MIL-STD-1553",1000000,"MIL-STD-1553",1000000,"MIL-STD-1553",1000000,"MIL-STD-1553",1000000,"MIL-STD-1553",1000000,"MIL-STD-1553",1000000,"MIL-STD-1553",1000000,"MIL-STD-1553",1000000,"MIL-STD-1553",1000000,"MIL-STD-1553",1000000,"MIL-STD-1553",1000000,"MIL-STD-1553",1000000,"MIL-STD-1553",1000000,"MIL-STD-1553",1000000,"MIL-STD-1553",1000000,"MIL-STD-1553",1000000,"MIL-STD-1553",1000000,"MIL-STD-1553",1000000,"MIL-STD-1553",1000000,"MIL-STD-1553",1000000,"MIL-STD-1553",1000000,"MIL-STD-1553",1000000,"MIL-STD-1553",1000000,"MIL-STD-1553",1000000,"MIL-STD-1553",1000000,"MIL-STD-1553",1000000,"MIL-STD-1553",1000000,"MIL-STD-1553",1000000,"MIL-STD-1553",1000000,"MIL-STD-1553",1000000,"MIL-STD-1553",1000000,"MIL-STD-1553",1000000,"MIL-STD-1553",1000000,"MIL-STD-1553",1000000,"MIL-STD-1553",1000000,"MIL-STD-1553",1000000,"MIL-STD-1553",1000000,"MIL-STD-1553",1000000,"MIL-STD-1553",1000000,"MIL-STD-1553",1000000,"MIL-STD-1553",1000000,"MIL-STD-1553",1000000,"MIL-STD-1553",1000000,"MIL-STD-1553",1000000,"MIL-STD-1553",1000000,"MIL-STD-1553",1000000,"MIL-STD-1553",1000000,"MIL-STD-1553",1000000,"MIL-STD-1553",1000000,"MIL-STD-1553",1000000,"MIL-STD-1553",1000000,"MIL-STD-1553",1000000,"MIL-STD-1553",1000000,"MIL-STD-1553",1000000,"MIL-STD-1553",1000000,"MIL-STD-1553",1000000,"MIL-STD-1553",1000000,"MIL-STD-1553",1000000,"MIL-STD-1553",1000000,"MIL-STD-1553",1000000,"MIL-STD-1553",1000000,"MIL-STD-1553",1000000,"MIL-STD-1553",1000000,"MIL-STD-1553",1000000,"MIL-STD-1553",1000000,"MIL-STD-1553",1000000,"MIL-STD-1553",1000000,"MIL-STD-1553",1000000,"MIL-STD-1553",1000000,"MIL-STD-1553",1000000,"MIL-STD-1553",1000000,"MIL-STD-1553",1000000,"MIL-STD-1553",1000000,"MIL-STD-1553",1000000,"MIL-STD-1553",1000000,"MIL-STD-1553",1000000,"MIL-STD-1553",1000000,"MIL-STD-1553",1000000,"MIL-STD-1553",1000000,"MIL-STD-1553",1000000,"MIL-STD-1553",1000000,"MIL-STD-1553",1000000,"MIL-STD-1553",1000000,"MIL-STD-1553",1000000,"MIL-STD-1553",1000000,"MIL-STD-1553",1000000,"MIL-STD-1553",1000000,"MIL-STD-1553",1000000,"MIL-STD-1553",1000000,"MIL-STD-1553",1000000,"MIL-STD-1553",1000000,"MIL-STD-1553",1000000,"MIL-STD-1553",1000000,"MIL-STD-1553",1000000,"MIL-STD-1553",1000000,"MIL-STD-1553",1000000,"MIL-STD-1553",1000000,"MIL-STD-1553",1000000,"MIL-STD-1553",1000000,"MIL-STD-1553",1000000,"MIL-STD-1553",1000000,"MIL-STD-1553",1000000,"MIL-STD-1553",1000000,"MIL-STD-1553",1000000,"MIL-STD-1553",1000000,"MIL-STD-1553",1000000,"MIL-STD-1553",1000000,"MIL-STD-1553",1000000,"MIL-STD-1553",1000000,"MIL-STD-1553",1000000,"MIL-STD-1553",1000000,"MIL-STD-1553",1000000,"MIL-STD-1553",1000000,"MIL-STD-1553",1000000,"MIL-STD-1553",1000000,"MIL-STD-1553",1000000,"MIL-STD-1553",1000000,"MIL-STD-1553",1000000,"MIL-STD-1553",1000000,"MIL-STD-1553",1000000,"MIL-STD-1553",1000000,"MIL-STD-1553",1000000,"MIL-STD-1553",1000000,"MIL-STD-1553",1000000,"MIL-STD-1553",1000000,"MIL-STD-1553",1000000,"MIL-STD-1553",1000000,"MIL-STD-1553",1000000,"MIL-STD-1553",1000000,"MIL-STD-1553",1000000,"MIL-STD-1553",1000000,"MIL-STD-1553",1000000,"MIL-STD-1553",1000000,"MIL-STD-1553",1000000,"MIL-STD-1553",1000000,"MIL-STD-1553",1000000,"MIL-STD-1553",1000000,"MIL-STD-1553",1000000,"MIL-STD-1553",1000000,"MIL-STD-1553",1000000,"MIL-STD-1553",1000000,"MIL-STD-1553",1000000,"MIL-STD-1553",1000000,"MIL-STD-1553",1000000,"MIL-STD-1553",1000000,"MIL-STD-1553",1000000,"MIL-STD-1553",1000000,"MIL-STD-1553",1000000,"MIL-STD-1553",1000000,"MIL-STD-1553",1000000,"MIL-STD-1553",1000000,"MIL-STD-1553",1000000,"MIL-STD-1553",1000000,"MIL-STD-1553",1000000,"MIL-STD-1553",1000000,"MIL-STD-1553",1000000,"MIL-STD-1553",1000000,"MIL-STD-1553",1000000,"MIL-STD-1553",1000000,"MIL-STD-1553",1000000,"MIL-STD-1553",1000000,"MIL-STD-1553",1000000,"MIL-STD-1553",1000000,"MIL-STD-1553",1000000,"MIL-STD-1553",1000000,"MIL-STD-1553",1000000,"MIL-STD-1553",1000000,"MIL-STD-1553",1000000,"MIL-STD-1553",1000000,"MIL-STD-1553",1000000,"MIL-STD-1553",1000000,"MIL-STD-1553",1000000,"MIL-STD-1553",1000000,"MIL-STD-1553",1000000,"MIL-STD-1553",1000000,"MIL-STD-1553",1000000,"MIL-STD-1553",1000000,"MIL-STD-1553",1000000,"MIL-STD-1553",1000000,"MIL-STD-1553",1000000,"MIL-STD-1553",1000000,"MIL-STD-1553",1000000,"MIL-STD-1553",1000000,"MIL-STD-1553",1000000,"MIL-STD-1553",1000000,"MIL-STD-1553",1000000,"MIL-STD-1553",1000000,"MIL-STD-1553",1000000,"MIL-STD-1553",1000000,"MIL-STD-1553",1000000,"MIL-STD-1553",1000000,"MIL-STD-1553",1000000,"MIL-STD-1553",1000000,"MIL-STD-1553",1000000,"MIL-STD-1553",1000000,"MIL-STD-1553",1000000,"MIL-STD-1553",1000000,"MIL-STD-1553",1000000,"MIL-STD-1553",1000000,"MIL-STD-1553",1000000,"MIL-STD-1553",1000000,"MIL-STD-1553",1000000,"MIL-STD-1553",1000000,"MIL-STD-1553",1000000,"MIL-STD-1553",1000000,"MIL-STD-1553",1000000,"MIL-STD-1553",1000000,"MIL-STD-1553",1000000,"MIL-STD-1553",1000000,"MIL-STD-1553",1000000,"MIL-STD-1553",1000000,"MIL-STD-1553",1000000,"MIL-STD-1553",1000000,"MIL-STD-1553",1000000,"MIL-STD-1553",1000000,"MIL-STD-1553",1000000,"MIL-STD-1553",1000000,"MIL-STD-1553",1000000,"MIL-STD-1553",1000000,"MIL-STD-1553",1000000,"MIL-STD-1553",1000000,"MIL-STD-1553",1000000,"MIL-STD-1553",1000000,"MIL-STD-1553",1000000,"MIL-STD-1553",1000000,"MIL-STD-1553",1000000,"MIL-STD-1553",1000000,"MIL-STD-1553",1000000,"MIL-STD-1553",1000000,"MIL-STD-1553",1000000,"MIL-STD-1553",1000000,"MIL-STD-1553",1000000,"MIL-STD-1553",1000000,"MIL-STD-1553",1000000,"MIL-STD-1553",1000000,"MIL-STD-1553",1000000,"MIL-STD-1553",1000000,"MIL-STD-1553",1000000,"MIL-STD-1553",1000000,"MIL-STD-1553",1000000,"MIL-STD-1553",1000000,"MIL-STD-1553",1000000,"MIL-STD-1553",1000000,"MIL-STD-1553",1000000,"MIL-STD-1553",1000000,"MIL-STD-1553",1000000,"MIL-STD-1553",1000000,"MIL-STD-1553",1000000,"MIL-STD-1553",1000000,"MIL-STD-1553",1000000,"MIL-STD-1553",1000000,"MIL-STD-1553",1000000,"MIL-STD-1553",1000000,"MIL-STD-1553",1000000,"MIL-STD-1553",1000000,"MIL-STD-1553",1000000,"MIL-STD-1553",1000000,"MIL-STD-1553",1000000,"MIL-STD-1553",1000000,"MIL-STD-1553",1000000,"MIL-STD-1553",1000000,"MIL-STD-1553",1000000,"MIL-STD-1553",1000000,"MIL-STD-1553",1000000,"MIL-STD-1553",1000000,"MIL-STD-1553",1000000,"MIL-STD-1553",1000000,"MIL-STD-1553",1000000,"MIL-STD-1553",1000000,"MIL-STD-1553",1000000,"MIL-STD-1553",1000000,"MIL-STD-1553",1000000,"MIL-STD-1553",1000000,"MIL-STD-1553",1000000,"MIL-STD-1553",1000000,"MIL-STD-1553",1000000,"MIL-STD-1553",1000000,"MIL-STD-1553",1000000,"MIL-STD-1553",1000000,"MIL-STD-1553",1000000,"MIL-STD-1553",1000000,"MIL-STD-1553",1000000,"MIL-STD-1553",1000000,"MIL-STD-1553",1000000,"MIL-STD-1553",1000000,"MIL-STD-1553",1000000,"MIL-STD-1553",1000000,"MIL-STD-1553",1000000,"MIL-STD-1553",1000000,"MIL-STD-1553",1000000,"MIL-STD-1553",1000000,"MIL-STD-1553",1000000,"MIL-STD-1553",1000000,"MIL-STD-1553",1000000,"MIL-STD-1553",1000000,"MIL-STD-1553",1000000,"MIL-STD-1553",1000000,"MIL-STD-1553",1000000,"MIL-STD-1553",1000000,"MIL-STD-1553",1000000,"MIL-STD-1553",1000000,"MIL-STD-1553",1000000,"MIL-STD-1553",1000000,"MIL-STD-1553",1000000,"MIL-STD-1553",1000000,"MIL-STD-1553",1000000,"MIL-STD-1553",1000000,"MIL-STD-1553",1000000,"MIL-STD-1553",1000000,"MIL-STD-1553",1000000,"MIL-STD-1553",1000000,"MIL-STD-1553",1000000,"MIL-STD-1553",1000000,"MIL-STD-1553",1000000,"MIL-STD-1553",1000000,"MIL-STD-1553",1000000,"MIL-STD-1553",1000000,"MIL-STD-1553",1000000,"MIL-STD-1553",1000000,"MIL-STD-1553",1000000,"MIL-STD-1553",1000000,"MIL-STD-1553",1000000,"MIL-STD-1553",1000000,"MIL-STD-1553",1000000,"MIL-STD-1553",1000000,"MIL-STD-1553",1000000,"MIL-STD-1553",1000000,"MIL-STD-1553",1000000,"MIL-STD-1553",1000000,"MIL-STD-1553",1000000,"MIL-STD-1553",1000000,"MIL-STD-1553",1000000,"MIL-STD-1553",1000000,"MIL-STD-1553",1000000,"MIL-STD-1553",1000000,"MIL-STD-1553",1000000,"MIL-STD-1553",1000000,"MIL-STD-1553",1000000,"MIL-STD-1553",1000000,"MIL-STD-1553",1000000,"MIL-STD-1553",1000000,"MIL-STD-1553",1000000,"MIL-STD-1553",1000000,"MIL-STD-1553",1000000,"MIL-STD-1553",1000000,"MIL-STD-1553",1000000,"MIL-STD-1553",1000000,"MIL-STD-1553",1000000,"MIL-STD-1553",1000000,"MIL-STD-1553",1000000,"MIL-STD-1553",1000000,"MIL-STD-1553",1000000,"MIL-STD-1553",1000000,"MIL-STD-1553",1000000,"MIL-STD-1553",1000000,"MIL-STD-1553",1000000,"MIL-STD-1553",1000000,"MIL-STD-1553",1000000,"MIL-STD-1553",1000000,"MIL-STD-1553",1000000,"MIL-STD-1553",1000000,"MIL-STD-1553",1000000,"MIL-STD-1553",1000000,"MIL-STD-1553",1000000,"MIL-STD-1553",1000000,"MIL-STD-1553",1000000,"MIL-STD-1553",1000000,"MIL-STD-1553",1000000,"MIL-STD-1553",1000000,"MIL-STD-1553",1000000,"MIL-STD-1553",1000000,"MIL-STD-1553",1000000,"MIL-STD-1553",1000000,"MIL-STD-1553",1000000,"MIL-STD-1553",1000000,"MIL-STD-1553",1000000,"MIL-STD-1553",1000000,"MIL-STD-1553",1000000,"MIL-STD-1553",1000000,"MIL-STD-1553",1000000,"MIL-STD-1553",1000000,"MIL-STD-1553",1000000,"MIL-STD-1553",1000000,"MIL-STD-1553",1000000,"MIL-STD-1553",1000000,"MIL-STD-1553",1000000,"MIL-STD-1553",1000000,"MIL-STD-1553",1000000,"MIL-STD-1553",1000000,"MIL-STD-1553",1000000,"MIL-STD-1553",1000000,"MIL-STD-1553",1000000,"MIL-STD-1553",1000000,"MIL-STD-1553",1000000,"MIL-STD-1553",1000000,"MIL-STD-1553",1000000,"MIL-STD-1553",1000000,"MIL-STD-1553",1000000,"MIL-STD-1553",1000000,"MIL-STD-1553",1000000,"MIL-STD-1553",1000000,"MIL-STD-1553",1000000,"MIL-STD-1553",1000000,"MIL-STD-1553",1000000,"MIL-STD-1553",1000000,"MIL-STD-1553",1000000,"MIL-STD-1553",1000000,"MIL-STD-1553",1000000,"MIL-STD-1553",1000000,"MIL-STD-1553",1000000,"MIL-STD-1553",1000000,"MIL-STD-1553",1000000,"MIL-STD-1553",1000000,"MIL-STD-1553",1000000,"MIL-STD-1553",1000000,"MIL-STD-1553",1000000,"MIL-STD-1553",1000000,"MIL-STD-1553",1000000,"MIL-STD-1553",1000000,"MIL-STD-1553",1000000,"MIL-STD-1553",1000000,"MIL-STD-1553",1000000,"MIL-STD-1553",1000000,"MIL-STD-1553",1000000,"MIL-STD-1553",1000000,"MIL-STD-1553",1000000,"MIL-STD-1553",1000000,"MIL-STD-1553",1000000,"MIL-STD-1553",1000000,"MIL-STD-1553",1000000,"MIL-STD-1553",1000000,"MIL-STD-1553",1000000,"MIL-STD-1553",1000000,"MIL-STD-1553",1000000,"MIL-STD-1553",1000000,"MIL-STD-1553",1000000,"MIL-STD-1553",1000000,"MIL-STD-1553",1000000,"MIL-STD-1553",1000000,"MIL-STD-1553",1000000,"MIL-STD-1553",1000000,"MIL-STD-1553",1000000,"MIL-STD-1553",1000000,"MIL-STD-1553",1000000,"MIL-STD-1553",1000000,"MIL-STD-1553",1000000,"MIL-STD-1553",1000000,"MIL-STD-1553",1000000,"MIL-STD-1553",1000000,"MIL-STD-1553",1000000,"MIL-STD-1553",1000000,"MIL-STD-1553",1000000,"MIL-STD-1553",1000000,"MIL-STD-1553",1000000,"MIL-STD-1553",1000000,"MIL-STD-1553",1000000,"MIL-STD-1553",1000000,"MIL-STD-1553",1000000,"MIL-STD-1553",1000000,"MIL-STD-1553",1000000,"MIL-STD-1553",1000000,"MIL-STD-1553",1000000,"MIL-STD-1553",1000000,"MIL-STD-1553",1000000,"MIL-STD-1553",1000000,"MIL-STD-1553",1000000,"MIL-STD-1553",1000000,"MIL-STD-1553",1000000,"MIL-STD-1553",1000000,"MIL-STD-1553",1000000,"MIL-STD-1553",1000000,"MIL-STD-1553",1000000,"MIL-STD-1553",1000000,"MIL-STD-1553",1000000,"MIL-STD-1553",1000000,"MIL-STD-1553",1000000,"MIL-STD-1553",1000000,"MIL-STD-1553",1000000,"MIL-STD-1553",1000000,"MIL-STD-1553",1000000,"MIL-STD-1553",1000000,"MIL-STD-1553",1000000,"MIL-STD-1553",1000000,"MIL-STD-1553",1000000,"MIL-STD-1553",1000000,"MIL-STD-1553",1000000,"MIL-STD-1553",1000000,"MIL-STD-1553",1000000,"MIL-STD-1553",1000000,"MIL-STD-1553",1000000,"MIL-STD-1553",1000000,"MIL-STD-1553",1000000,"MIL-STD-1553",1000000,"MIL-STD-1553",1000000,"MIL-STD-1553",1000000,"MIL-STD-1553",1000000,"MIL-STD-1553",1000000,"MIL-STD-1553",1000000,"MIL-STD-1553",1000000,"MIL-STD-1553",1000000,"MIL-STD-1553",1000000,"MIL-STD-1553",1000000,"MIL-STD-1553",1000000,"MIL-STD-1553",1000000,"MIL-STD-1553",1000000,"MIL-STD-1553",1000000,"MIL-STD-1553",1000000,"MIL-STD-1553",1000000,"MIL-STD-1553",1000000,"MIL-STD-1553",1000000,"MIL-STD-1553",1000000,"MIL-STD-1553",1000000,"MIL-STD-1553",1000000,"MIL-STD-1553",1000000,"MIL-STD-1553",1000000,"MIL-STD-1553",1000000,"MIL-STD-1553",1000000,"MIL-STD-1553",1000000,"MIL-STD-1553",1000000,"MIL-STD-1553",1000000,"MIL-STD-1553",1000000,"MIL-STD-1553",1000000,"MIL-STD-1553",1000000,"MIL-STD-1553",1000000,"MIL-STD-1553",1000000,"MIL-STD-1553",1000000,"MIL-STD-1553",1000000,"MIL-STD-1553",1000000,"MIL-STD-1553",1000000,"MIL-STD-1553",1000000,"MIL-STD-1553",1000000,"MIL-STD-1553",1000000,"MIL-STD-1553",1000000,"MIL-STD-1553",1000000,"MIL-STD-1553",1000000,"MIL-STD-1553",1000000,"MIL-STD-1553",1000000,"MIL-STD-1553",1000000,"MIL-STD-1553",1000000,"MIL-STD-1553",1000000,"MIL-STD-1553",1000000,"MIL-STD-1553",1000000,"MIL-STD-1553",1000000,"MIL-STD-1553",1000000,"MIL-STD-1553",1000000,"MIL-STD-1553",1000000,"MIL-STD-1553",1000000,"MIL-STD-1553",1000000,"MIL-STD-1553",1000000,"MIL-STD-1553",1000000,"MIL-STD-1553",1000000,"MIL-STD-1553",1000000,"MIL-STD-1553",1000000,"MIL-STD-1553",1000000,"MIL-STD-1553",1000000,"MIL-STD-1553",1000000,"MIL-STD-1553",1000000,"MIL-STD-1553",1000000,"MIL-STD-1553",1000000,"MIL-STD-1553",1000000,"MIL-STD-1553",1000000,"MIL-STD-1553",1000000,"MIL-STD-1553",1000000,"MIL-STD-1553",1000000,"MIL-STD-1553",1000000,"MIL-STD-1553",1000000,"MIL-STD-1553",1000000,"MIL-STD-1553",1000000,"MIL-STD-1553",1000000,"MIL-STD-1553",1000000,"MIL-STD-1553",1000000,"MIL-STD-1553",1000000,"MIL-STD-1553",1000000,"MIL-STD-1553",1000000,"MIL-STD-1553",1000000,"MIL-STD-1553",1000000,"MIL-STD-1553",1000000,"MIL-STD-1553",1000000,"MIL-STD-1553",1000000,"MIL-STD-1553",1000000,"MIL-STD-1553",1000000,"MIL-STD-1553",1000000,"MIL-STD-1553",1000000,"MIL-STD-1553",1000000,"MIL-STD-1553",1000000,"MIL-STD-1553",1000000,"MIL-STD-1553",1000000,"MIL-STD-1553",1000000,"MIL-STD-1553",1000000,"MIL-STD-1553",1000000,"MIL-STD-1553",1000000,"MIL-STD-1553",1000000,"MIL-STD-1553",1000000,"MIL-STD-1553",1000000,"MIL-STD-1553",1000000,"MIL-STD-1553",1000000,"MIL-STD-1553",1000000,"MIL-STD-1553",1000000,"MIL-STD-1553",1000000,"MIL-STD-1553",1000000,"MIL-STD-1553",1000000,"MIL-STD-1553",1000000,"MIL-STD-1553",1000000,"MIL-STD-1553",1000000,"MIL-STD-1553",1000000,"MIL-STD-1553",1000000,"MIL-STD-1553",1000000,"MIL-STD-1553",1000000,"MIL-STD-1553",1000000,"MIL-STD-1553",1000000,"MIL-STD-1553",1000000,"MIL-STD-1553",1000000,"MIL-STD-1553",1000000,"MIL-STD-1553",1000000,"MIL-STD-1553",1000000,"MIL-STD-1553",1000000,"MIL-STD-1553",1000000,"MIL-STD-1553",1000000,"MIL-STD-1553",1000000,"MIL-STD-1553",1000000,"MIL-STD-1553",1000000,"MIL-STD-1553",1000000,"MIL-STD-1553",1000000,"MIL-STD-1553",1000000,"MIL-STD-1553",1000000,"MIL-STD-1553",1000000,"MIL-STD-1553",1000000,"MIL-STD-1553",1000000,"MIL-STD-1553",1000000,"MIL-STD-1553",1000000,"MIL-STD-1553",1000000,"MIL-STD-1553",1000000,"MIL-STD-1553",1000000,"MIL-STD-1553",1000000,"MIL-STD-1553",1000000,"MIL-STD-1553",1000000,"MIL-STD-1553",1000000,"MIL-STD-1553",1000000,"MIL-STD-1553",1000000,"MIL-STD-1553",1000000,"MIL-STD-1553",1000000,"MIL-STD-1553",1000000,"MIL-STD-1553",1000000,"MIL-STD-1553",1000000,"MIL-STD-1553",1000000,"MIL-STD-1553",1000000,"MIL-STD-1553",1000000,"MIL-STD-1553",1000000,"MIL-STD-1553",1000000,"MIL-STD-1553",1000000,"MIL-STD-1553",1000000,"MIL-STD-1553",1000000,"MIL-STD-1553",1000000,"MIL-STD-1553",1000000,"MIL-STD-1553",1000000,"MIL-STD-1553",1000000,"MIL-STD-1553",1000000,"MIL-STD-1553",1000000,"MIL-STD-1553",1000000,"MIL-STD-1553",1000000,"MIL-STD-1553",1000000,"MIL-STD-1553",1000000,"MIL-STD-1553",1000000,"MIL-STD-1553",1000000,"MIL-STD-1553",1000000,"MIL-STD-1553",1000000,"MIL-STD-1553",1000000,"MIL-STD-1553",1000000,"MIL-STD-1553",1000000,"MIL-STD-1553",1000000,"MIL-STD-1553",1000000,"MIL-STD-1553",1000000,"MIL-STD-1553",1000000,"MIL-STD-1553",1000000,"MIL-STD-1553",1000000,"MIL-STD-1553",1000000,"MIL-STD-1553",1000000,"MIL-STD-1553",1000000,"MIL-STD-1553",1000000,"MIL-STD-1553",1000000,"MIL-STD-1553",1000000,"MIL-STD-1553",1000000,"MIL-STD-1553",1000000,"MIL-STD-1553",1000000,"MIL-STD-1553",1000000,"MIL-STD-1553",1000000,"MIL-STD-1553",1000000,"MIL-STD-1553",1000000,"MIL-STD-1553",1000000,"MIL-STD-1553",1000000,"MIL-STD-1553",1000000,"MIL-STD-1553",1000000,"MIL-STD-1553",1000000,"MIL-STD-1553",1000000,"MIL-STD-1553",1000000,"MIL-STD-1553",1000000,"MIL-STD-1553",1000000,"MIL-STD-1553",1000000,"MIL-STD-1553",1000000,"MIL-STD-1553",1000000,"MIL-STD-1553",1000000,"MIL-STD-1553",1000000,"MIL-STD-1553",1000000,"MIL-STD-1553",1000000,"MIL-STD-1553",1000000,"MIL-STD-1553",1000000,"MIL-STD-1553",1000000,"MIL-STD-1553",1000000,"MIL-STD-1553",1000000,"MIL-STD-1553",1000000,"MIL-STD-1553",1000000,"MIL-STD-1553",1000000,"MIL-STD-1553",1000000,"MIL-STD-1553",1000000,"MIL-STD-1553",1000000,"MIL-STD-1553",1000000,"MIL-STD-1553",1000000,"MIL-STD-1553",1000000,"MIL-STD-1553",1000000,"MIL-STD-1553",1000000,"MIL-STD-1553",1000000,"MIL-STD-1553",1000000,"MIL-STD-1553",1000000,"MIL-STD-1553",1000000,"MIL-STD-1553",1000000,"MIL-STD-1553",1000000,"MIL-STD-1553",1000000,"MIL-STD-1553",1000000,"MIL-STD-1553",1000000,"MIL-STD-1553",1000000,"MIL-STD-1553",1000000,"MIL-STD-1553",1000000,"MIL-STD-1553",1000000,"MIL-STD-1553",1000000,"MIL-STD-1553",1000000,"MIL-STD-1553",1000000,"MIL-STD-1553",1000000,"MIL-STD-1553",1000000,"MIL-STD-1553",1000000,"MIL-STD-1553",1000000,"MIL-STD-1553",1000000,"MIL-STD-1553",1000000,"MIL-STD-1553",1000000,"MIL-STD-1553",1000000,"MIL-STD-1553",1000000,"MIL-STD-1553",1000000,"MIL-STD-1553",1000000,"MIL-STD-1553",1000000,"MIL-STD-1553",1000000,"MIL-STD-1553",1000000,"MIL-STD-1553",1000000,"MIL-STD-1553",1000000,"MIL-STD-1553",1000000,"MIL-STD-1553",1000000,"MIL-STD-1553",1000000,"MIL-STD-1553",1000000,"MIL-STD-1553",1000000,"MIL-STD-1553",1000000,"MIL-STD-1553",1000000,"MIL-STD-1553",1000000,"MIL-STD-1553",1000000,"MIL-STD-1553",1000000,"MIL-STD-1553",1000000,"MIL-STD-1553",1000000,"MIL-STD-1553",1000000,"MIL-STD-1553",1000000,"MIL-STD-1553",1000000,"MIL-STD-1553",1000000,"MIL-STD-1553",1000000,"MIL-STD-1553",1000000,"MIL-STD-1553",1000000,"MIL-STD-1553",1000000,"MIL-STD-1553",1000000,"MIL-STD-1553",1000000,"MIL-STD-1553",1000000,"MIL-STD-1553",1000000,"MIL-STD-1553",1000000,"MIL-STD-1553",1000000,"MIL-STD-1553",1000000,"MIL-STD-1553",1000000,"MIL-STD-1553",1000000,"MIL-STD-1553",1000000,"MIL-STD-1553",1000000,"MIL-STD-1553",1000000,"MIL-STD-1553",1000000,"MIL-STD-1553",1000000,"MIL-STD-1553",1000000,"MIL-STD-1553",1000000,"MIL-STD-1553",1000000,"MIL-STD-1553",1000000,"MIL-STD-1553",1000000,"MIL-STD-1553",1000000,"MIL-STD-1553",1000000,"MIL-STD-1553",1000000,"MIL-STD-1553",1000000,"MIL-STD-1553",1000000,"MIL-STD-1553",1000000,"MIL-STD-1553",1000000,"MIL-STD-1553",1000000,"MIL-STD-1553",1000000,"MIL-STD-1553",1000000,"MIL-STD-1553",1000000,"MIL-STD-1553",1000000,"MIL-STD-1553",1000000,"MIL-STD-1553",1000000,"MIL-STD-1553",1000000,"MIL-STD-1553",1000000,"MIL-STD-1553",1000000,"MIL-STD-1553",1000000,"MIL-STD-1553",1000000,"MIL-STD-1553",1000000,"MIL-STD-1553",1000000,"MIL-STD-1553",1000000,"MIL-STD-1553",1000000,"MIL-STD-1553",1000000,"MIL-STD-1553",1000000,"MIL-STD-1553",1000000,"MIL-STD-1553",1000000,"MIL-STD-1553",1000000,"MIL-STD-1553",1000000,"MIL-STD-1553",1000000,"MIL-STD-1553",1000000,"MIL-STD-1553",1000000,"MIL-STD-1553",1000000,"MIL-STD-1553",1000000,"MIL-STD-1553",1000000,"MIL-STD-1553",1000000,"MIL-STD-1553",1000000,"MIL-STD-1553",1000000,"MIL-STD-1553",1000000,"MIL-STD-1553",1000000,"MIL-STD-1553",1000000,"MIL-STD-1553",1000000,"MIL-STD-1553",1000000,"MIL-STD-1553",1000000,"MIL-STD-1553",1000000,"MIL-STD-1553",1000000,"MIL-STD-1553",1000000,"MIL-STD-1553",1000000,"MIL-STD-1553",1000000,"MIL-STD-1553",1000000,"MIL-STD-1553",1000000,"MIL-STD-1553",1000000,"MIL-STD-1553",1000000,"MIL-STD-1553",1000000,"MIL-STD-1553",1000000,"MIL-STD-1553",1000000,"MIL-STD-1553",1000000,"MIL-STD-1553",1000000,"MIL-STD-1553",1000000,"MIL-STD-1553",1000000,"MIL-STD-1553",1000000,"MIL-STD-1553",1000000,"MIL-STD-1553",1000000,"MIL-STD-1553",1000000,"MIL-STD-1553",1000000,"MIL-STD-1553",1000000,"MIL-STD-1553",1000000,"MIL-STD-1553",1000000,"MIL-STD-1553",1000000,"MIL-STD-1553",1000000,"MIL-STD-1553",1000000,"MIL-STD-1553",1000000,"MIL-STD-1553",1000000,"MIL-STD-1553",1000000,"MIL-STD-1553",1000000,"MIL-STD-1553",1000000,"MIL-STD-1553",1000000,"MIL-STD-1553",1000000,"MIL-STD-1553",1000000,"MIL-STD-1553",1000000,"MIL-STD-1553",1000000,"MIL-STD-1553",1000000,"MIL-STD-1553",1000000,"MIL-STD-1553",1000000,"MIL-STD-1553",1000000,"MIL-STD-1553",1000000,"MIL-STD-1553",1000000,"MIL-STD-1553",1000000,"MIL-STD-1553",1000000,"MIL-STD-1553",1000000,"MIL-STD-1553",1000000,"MIL-STD-1553",1000000,"MIL-STD-1553",1000000,"MIL-STD-1553",1000000,"MIL-STD-1553",1000000,"MIL-STD-1553",1000000,"MIL-STD-1553",1000000,"MIL-STD-1553",1000000,"MIL-STD-1553",1000000,"MIL-STD-1553",1000000,"MIL-STD-1553",1000000,"MIL-STD-1553",1000000,"MIL-STD-1553",1000000,"MIL-STD-1553",1000000,"MIL-STD-1553",1000000,"MIL-STD-1553",1000000,"MIL-STD-1553",1000000,"MIL-STD-1553",1000000,"MIL-STD-1553",1000000,"MIL-STD-1553",1000000,"MIL-STD-1553",1000000,"MIL-STD-1553",1000000,"MIL-STD-1553",1000000,"MIL-STD-1553",1000000,"MIL-STD-1553",1000000,"MIL-STD-1553",1000000,"MIL-STD-1553",1000000,"MIL-STD-1553",1000000,"MIL-STD-1553",1000000,"MIL-STD-1553",1000000,"MIL-STD-1553",1000000,"MIL-STD-1553",1000000,"MIL-STD-1553",1000000,"MIL-STD-1553",1000000,"MIL-STD-1553",1000000,"MIL-STD-1553",1000000,"MIL-STD-1553",1000000,"MIL-STD-1553",1000000,"MIL-STD-1553",1000000,"MIL-STD-1553",1000000,"MIL-STD-1553",1000000,"MIL-STD-1553",1000000,"MIL-STD-1553",1000000,"MIL-STD-1553",1000000,"MIL-STD-1553",1000000,"MIL-STD-1553",1000000,"MIL-STD-1553",1000000,"MIL-STD-1553",1000000,"MIL-STD-1553",1000000,"MIL-STD-1553",1000000,"MIL-STD-1553",1000000,"MIL-STD-1553",1000000,"MIL-STD-1553",1000000,"MIL-STD-1553",1000000,"MIL-STD-1553",1000000,"MIL-STD-1553",1000000,"MIL-STD-1553",1000000,"MIL-STD-1553",1000000,"MIL-STD-1553",1000000,"MIL-STD-1553",1000000,"MIL-STD-1553",1000000,"MIL-STD-1553",1000000,"MIL-STD-1553",1000000,"MIL-STD-1553",1000000,"MIL-STD-1553",1000000,"MIL-STD-1553",1000000,"MIL-STD-1553",1000000,"MIL-STD-1553",1000000,"MIL-STD-1553",1000000,"MIL-STD-1553",1000000,"MIL-STD-1553",1000000,"MIL-STD-1553",1000000,"MIL-STD-1553",1000000,"MIL-STD-1553",1000000,"MIL-STD-1553",1000000,"MIL-STD-1553",1000000,"MIL-STD-1553",1000000,"MIL-STD-1553",1000000,"MIL-STD-1553",1000000,"MIL-STD-1553",1000000,"MIL-STD-1553",1000000,"MIL-STD-1553",1000000,"MIL-STD-1553",1000000,"MIL-STD-1553",1000000,"MIL-STD-1553",1000000,"MIL-STD-1553",1000000,"MIL-STD-1553",1000000,"MIL-STD-1553",1000000,"MIL-STD-1553",1000000,"MIL-STD-1553",1000000,"MIL-STD-1553",1000000,"MIL-STD-1553",1000000,"MIL-STD-1553",1000000,"MIL-STD-1553",1000000,"MIL-STD-1553",1000000,"MIL-STD-1553",1000000,"MIL-STD-1553",1000000,"MIL-STD-1553",1000000,"MIL-STD-1553",1000000,"MIL-STD-1553",1000000,"MIL-STD-1553",1000000,"MIL-STD-1553",1000000,"MIL-STD-1553",1000000,"MIL-STD-1553",1000000,"MIL-STD-1553",1000000,"MIL-STD-1553",1000000,"MIL-STD-1553",1000000,"MIL-STD-1553",1000000,"MIL-STD-1553",1000000,"MIL-STD-1553",1000000,"MIL-STD-1553",1000000,"MIL-STD-1553",1000000,"MIL-STD-1553",1000000,"MIL-STD-1553",1000000,"MIL-STD-1553",1000000,"MIL-STD-1553",1000000,"MIL-STD-1553",1000000,"MIL-STD-1553",1000000,"MIL-STD-1553",1000000,"MIL-STD-1553",1000000,"MIL-STD-1553",1000000,"MIL-STD-1553",1000000,"MIL-STD-1553",1000000,"MIL-STD-1553",1000000,"MIL-STD-1553",1000000,"MIL-STD-1553",1000000,"MIL-STD-1553",1000000,"MIL-STD-1553",1000000,"MIL-STD-1553",1000000,"MIL-STD-1553",1000000,"MIL-STD-1553",1000000,"MIL-STD-1553",1000000,"MIL-STD-1553",1000000,"MIL-STD-1553",1000000,"MIL-STD-1553",1000000,"MIL-STD-1553",1000000,"MIL-STD-1553",1000000,"MIL-STD-1553",1000000,"MIL-STD-1553",1000000,"MIL-STD-1553",1000000,"MIL-STD-1553",1000000,"MIL-STD-1553",1000000,"MIL-STD-1553",1000000,"MIL-STD-1553",1000000,"MIL-STD-1553",1000000,"MIL-STD-1553",1000000,"MIL-STD-1553",1000000,"MIL-STD-1553",1000000,"MIL-STD-1553",1000000,"MIL-STD-1553",1000000,"MIL-STD-1553",1000000,"MIL-STD-1553",1000000,"MIL-STD-1553",1000000,"MIL-STD-1553",1000000,"MIL-STD-1553",1000000,"MIL-STD-1553",1000000,"MIL-STD-1553",1000000,"MIL-STD-1553",1000000,"MIL-STD-1553",1000000,"MIL-STD-1553",1000000,"MIL-STD-1553",1000000,"MIL-STD-1553",1000000,"MIL-STD-1553",1000000,"MIL-STD-1553",1000000,"MIL-STD-1553",1000000,"MIL-STD-1553",1000000,"MIL-STD-1553",1000000,"MIL-STD-1553",1000000,"MIL-STD-1553",1000000,"MIL-STD-1553",1000000,"MIL-STD-1553",1000000,"MIL-STD-1553",1000000,"MIL-STD-1553",1000000,"MIL-STD-1553",1000000,"MIL-STD-1553",1000000,"MIL-STD-1553",1000000,"MIL-STD-1553",1000000,"MIL-STD-1553",1000000,"MIL-STD-1553",1000000,"MIL-STD-1553",1000000,"MIL-STD-1553",1000000,"MIL-STD-1553",1000000,"MIL-STD-1553",1000000,"MIL-STD-1553",1000000,"MIL-STD-1553",1000000,"MIL-STD-1553",1000000,"MIL-STD-1553",1000000,"MIL-STD-1553",1000000,"MIL-STD-1553",1000000,"MIL-STD-1553",1000000,"MIL-STD-1553",1000000,"MIL-STD-1553",1000000,"MIL-STD-1553",1000000,"MIL-STD-1553",1000000,"MIL-STD-1553",1000000,"MIL-STD-1553",1000000,"MIL-STD-1553",1000000,"MIL-STD-1553",1000000,"MIL-STD-1553",1000000,"MIL-STD-1553",1000000,"MIL-STD-1553",1000000,"MIL-STD-1553",1000000,"MIL-STD-1553",1000000,"MIL-STD-1553",1000000,"MIL-STD-1553",1000000,"MIL-STD-1553",1000000,"MIL-STD-1553",1000000,"MIL-STD-1553",1000000,"MIL-STD-1553",1000000,"MIL-STD-1553",1000000,"MIL-STD-1553",1000000,"MIL-STD-1553",1000000,"MIL-STD-1553",1000000,"MIL-STD-1553",1000000,"MIL-STD-1553",1000000,"MIL-STD-1553",1000000,"MIL-STD-1553",1000000,"MIL-STD-1553",1000000,"MIL-STD-1553",1000000,"MIL-STD-1553",1000000,"MIL-STD-1553",1000000,"MIL-STD-1553",1000000,"MIL-STD-1553",1000000,"MIL-STD-1553",1000000,"MIL-STD-1553",1000000,"MIL-STD-1553",1000000,"MIL-STD-1553",1000000,"MIL-STD-1553",1000000,"MIL-STD-1553",1000000,"MIL-STD-1553",1000000,"MIL-STD-1553",1000000,"MIL-STD-1553",1000000,"MIL-STD-1553",1000000,"MIL-STD-1553",1000000,"MIL-STD-1553",1000000,"MIL-STD-1553",1000000,"MIL-STD-1553",1000000,"MIL-STD-1553",1000000,"MIL-STD-1553",1000000,"MIL-STD-1553",1000000,"MIL-STD-1553",1000000,"MIL-STD-1553",1000000,"MIL-STD-1553",1000000,"MIL-STD-1553",1000000,"MIL-STD-1553",1000000,"MIL-STD-1553",1000000,"MIL-STD-1553",1000000,"MIL-STD-1553",1000000,"MIL-STD-1553",1000000,"MIL-STD-1553",1000000,"MIL-STD-1553",1000000,"MIL-STD-1553",1000000,"MIL-STD-1553",1000000,"MIL-STD-1553",1000000,"MIL-STD-1553",1000000,"MIL-STD-1553",1000000,"MIL-STD-1553",1000000,"MIL-STD-1553",1000000,"MIL-STD-1553",1000000,"MIL-STD-1553",1000000,"MIL-STD-1553",1000000,"MIL-STD-1553",1000000,"MIL-STD-1553",1000000,"MIL-STD-1553",1000000,"MIL-STD-1553",1000000,"MIL-STD-1553",1000000,"MIL-STD-1553",1000000,"MIL-STD-1553",1000000,"MIL-STD-1553",1000000,"MIL-STD-1553",1000000,"MIL-STD-1553",1000000,"MIL-STD-1553",1000000,"MIL-STD-1553",1000000,"MIL-STD-1553",1000000,"MIL-STD-1553",1000000,"MIL-STD-1553",1000000,"MIL-STD-1553",1000000,"MIL-STD-1553",1000000,"MIL-STD-1553",1000000,"MIL-STD-1553",1000000,"MIL-STD-1553",1000000,"MIL-STD-1553",1000000,"MIL-STD-1553",1000000,"MIL-STD-1553",1000000,"MIL-STD-1553",1000000,"MIL-STD-1553",1000000,"MIL-STD-1553",1000000,"MIL-STD-1553",1000000,"MIL-STD-1553",1000000,"MIL-STD-1553",1000000,"MIL-STD-1553",1000000,"MIL-STD-1553",1000000,"MIL-STD-1553",1000000,"MIL-STD-1553",1000000,"MIL-STD-1553",1000000,"MIL-STD-1553",1000000,"MIL-STD-1553",1000000,"MIL-STD-1553",1000000,"MIL-STD-1553",1000000,"MIL-STD-1553",1000000,"MIL-STD-1553",1000000,"MIL-STD-1553",1000000,"MIL-STD-1553",1000000,"MIL-STD-1553",1000000,"MIL-STD-1553",1000000,"MIL-STD-1553",1000000,"MIL-STD-1553",1000000,"MIL-STD-1553",1000000,"MIL-STD-1553",1000000,"MIL-STD-1553",1000000,"MIL-STD-1553",1000000,"MIL-STD-1553",1000000,"MIL-STD-1553",1000000,"MIL-STD-1553",1000000,"MIL-STD-1553",1000000,"MIL-STD-1553",1000000,"MIL-STD-1553",1000000,"MIL-STD-1553",1000000,"MIL-STD-1553",1000000,"MIL-STD-1553",1000000,"MIL-STD-1553",1000000,"MIL-STD-1553",1000000,"MIL-STD-1553",1000000,"MIL-STD-1553",1000000,"MIL-STD-1553",1000000,"MIL-STD-1553",1000000,"MIL-STD-1553",1000000,"MIL-STD-1553",1000000,"MIL-STD-1553",1000000,"MIL-STD-1553",1000000,"MIL-STD-1553",1000000,"MIL-STD-1553",1000000,"MIL-STD-1553",1000000,"MIL-STD-1553",1000000,"MIL-STD-1553",1000000,"MIL-STD-1553",1000000,"MIL-STD-1553",1000000,"MIL-STD-1553",1000000,"MIL-STD-1553",1000000,"MIL-STD-1553",1000000,"MIL-STD-1553",1000000,"MIL-STD-1553",1000000,"MIL-STD-1553",1000000,"MIL-STD-1553",1000000,"MIL-STD-1553",1000000,"MIL-STD-1553",1000000,"MIL-STD-1553",1000000,"MIL-STD-1553",1000000,"MIL-STD-1553",1000000,"MIL-STD-1553",1000000,"MIL-STD-1553",1000000,"MIL-STD-1553",1000000,"MIL-STD-1553",1000000,"MIL-STD-1553",1000000,"MIL-STD-1553",1000000,"MIL-STD-1553",1000000,"MIL-STD-1553",1000000,"MIL-STD-1553",1000000,"MIL-STD-1553",1000000,"MIL-STD-1553",1000000,"MIL-STD-1553",1000000,"MIL-STD-1553",1000000,"MIL-STD-1553",1000000,"MIL-STD-1553",1000000,"MIL-STD-1553",1000000,"MIL-STD-1553",1000000,"MIL-STD-1553",1000000,"MIL-STD-1553",1000000,"MIL-STD-1553",1000000,"MIL-STD-1553",1000000,"MIL-STD-1553",1000000,"MIL-STD-1553",1000000,"MIL-STD-1553",1000000,"MIL-STD-1553",1000000,"MIL-STD-1553",1000000,"MIL-STD-1553",1000000,"MIL-STD-1553",1000000,"MIL-STD-1553",1000000,"MIL-STD-1553",1000000,"MIL-STD-1553",1000000,"MIL-STD-1553",1000000,"MIL-STD-1553",1000000,"MIL-STD-1553",1000000,"MIL-STD-1553",1000000,"MIL-STD-1553",1000000,"MIL-STD-1553",1000000,"MIL-STD-1553",1000000,"MIL-STD-1553",1000000,"MIL-STD-1553",1000000,"MIL-STD-1553",1000000,"MIL-STD-1553",1000000,"MIL-STD-1553",1000000,"MIL-STD-1553",1000000,"MIL-STD-1553",1000000,"MIL-STD-1553",1000000,"MIL-STD-1553",1000000,"MIL-STD-1553",1000000,"MIL-STD-1553",1000000,"MIL-STD-1553",1000000,"MIL-STD-1553",1000000,"MIL-STD-1553",1000000,"MIL-STD-1553",1000000,"MIL-STD-1553",1000000,"MIL-STD-1553",1000000,"MIL-STD-1553",1000000,"MIL-STD-1553",1000000,"MIL-STD-1553",1000000,"MIL-STD-1553",1000000,"MIL-STD-1553",1000000,"MIL-STD-1553",1000000,"MIL-STD-1553",1000000,"MIL-STD-1553",1000000,"MIL-STD-1553",1000000,"MIL-STD-1553",1000000,"MIL-STD-1553",1000000,"MIL-STD-1553",1000000,"MIL-STD-1553",1000000,"MIL-STD-1553",1000000,"MIL-STD-1553",1000000,"MIL-STD-1553",1000000,"MIL-STD-1553",1000000,"MIL-STD-1553",1000000,"MIL-STD-1553",1000000,"MIL-STD-1553",1000000,"MIL-STD-1553",1000000,"MIL-STD-1553",1000000,"MIL-STD-1553",1000000,"MIL-STD-1553",1000000,"MIL-STD-1553",1000000,"MIL-STD-1553",1000000,"MIL-STD-1553",1000000,"MIL-STD-1553",1000000,"MIL-STD-1553",1000000,"MIL-STD-1553",1000000,"MIL-STD-1553",1000000,"MIL-STD-1553",1000000,"MIL-STD-1553",1000000,"MIL-STD-1553",1000000,"MIL-STD-1553",1000000,"MIL-STD-1553",1000000,"MIL-STD-1553",1000000,"MIL-STD-1553",1000000,"MIL-STD-1553",1000000,"MIL-STD-1553",1000000,"MIL-STD-1553",1000000,"MIL-STD-1553",1000000,"MIL-STD-1553",1000000,"MIL-STD-1553",1000000,"MIL-STD-1553",1000000,"MIL-STD-1553",1000000,"MIL-STD-1553",1000000,"MIL-STD-1553",1000000,"MIL-STD-1553",1000000,"MIL-STD-1553",1000000,"MIL-STD-1553",1000000,"MIL-STD-1553",1000000,"MIL-STD-1553",1000000,"MIL-STD-1553",1000000,"MIL-STD-1553",1000000,"MIL-STD-1553",1000000,"MIL-STD-1553",1000000,"MIL-STD-1553",1000000,"MIL-STD-1553",1000000,"MIL-STD-1553",1000000,"MIL-STD-1553",1000000,"MIL-STD-1553",1000000,"MIL-STD-1553",1000000,"MIL-STD-1553",1000000,"MIL-STD-1553",1000000,"MIL-STD-1553",1000000,"MIL-STD-1553",1000000,"MIL-STD-1553",1000000,"MIL-STD-1553",1000000,"MIL-STD-1553",1000000,"MIL-STD-1553",1000000,"MIL-STD-1553",1000000,"MIL-STD-1553",1000000,"MIL-STD-1553",1000000,"MIL-STD-1553",1000000,"MIL-STD-1553",1000000,"MIL-STD-1553",1000000,"MIL-STD-1553",1000000,"MIL-STD-1553",1000000,"MIL-STD-1553",1000000,"MIL-STD-1553",1000000,"MIL-STD-1553",1000000,"MIL-STD-1553",1000000,"MIL-STD-1553",1000000,"MIL-STD-1553",1000000,"MIL-STD-1553",1000000,"MIL-STD-1553",1000000,"MIL-STD-1553",1000000,"MIL-STD-1553",1000000,"MIL-STD-1553",1000000,"MIL-STD-1553",1000000,"MIL-STD-1553",1000000,"MIL-STD-1553",1000000,"MIL-STD-1553",1000000,"MIL-STD-1553",1000000,"MIL-STD-1553",1000000,"MIL-STD-1553",1000000,"MIL-STD-1553",1000000,"MIL-STD-1553",1000000,"MIL-STD-1553",1000000,"MIL-STD-1553",1000000,"MIL-STD-1553",1000000,"MIL-STD-1553",1000000,"MIL-STD-1553",1000000,"MIL-STD-1553",1000000,"MIL-STD-1553",1000000,"MIL-STD-1553",1000000,"MIL-STD-1553",1000000,"MIL-STD-1553",1000000,"MIL-STD-1553",1000000,"MIL-STD-1553",1000000,"MIL-STD-1553",1000000,"MIL-STD-1553",1000000,"MIL-STD-1553",1000000,"MIL-STD-1553",1000000,"MIL-STD-1553",1000000,"MIL-STD-1553",1000000,"MIL-STD-1553",1000000,"MIL-STD-1553",1000000,"MIL-STD-1553",1000000,"MIL-STD-1553",1000000,"MIL-STD-1553",1000000,"MIL-STD-1553",1000000,"MIL-STD-1553",1000000,"MIL-STD-1553",1000000,"MIL-STD-1553",1000000,"MIL-STD-1553",1000000,"MIL-STD-1553",1000000,"MIL-STD-1553",1000000,"MIL-STD-1553",1000000,"MIL-STD-1553",1000000,"MIL-STD-1553",1000000,"MIL-STD-1553",1000000,"MIL-STD-1553",1000000,"MIL-STD-1553",1000000,"MIL-STD-1553",1000000,"MIL-STD-1553",1000000,"MIL-STD-1553",1000000,"MIL-STD-1553",1000000,"MIL-STD-1553",1000000,"MIL-STD-1553",1000000,"MIL-STD-1553",1000000,"MIL-STD-1553",1000000,"MIL-STD-1553",1000000,"MIL-STD-1553",1000000,"MIL-STD-1553",1000000,"MIL-STD-1553",1000000,"MIL-STD-1553",1000000,"MIL-STD-1553",1000000,"MIL-STD-1553",1000000,"MIL-STD-1553",1000000,"MIL-STD-1553",1000000,"MIL-STD-1553",1000000,"MIL-STD-1553",1000000,"MIL-STD-1553",1000000,"MIL-STD-1553",1000000,"MIL-STD-1553",1000000,"MIL-STD-1553",1000000,"MIL-STD-1553",1000000,"MIL-STD-1553",1000000,"MIL-STD-1553",1000000,"MIL-STD-1553",1000000,"MIL-STD-1553",1000000,"MIL-STD-1553",1000000,"MIL-STD-1553",1000000,"MIL-STD-1553",1000000,"MIL-STD-1553",1000000,"MIL-STD-1553",1000000,"MIL-STD-1553",1000000,"MIL-STD-1553",1000000,"MIL-STD-1553",1000000,"MIL-STD-1553",1000000,"MIL-STD-1553",1000000,"MIL-STD-1553",1000000,"MIL-STD-1553",1000000,"MIL-STD-1553",1000000,"MIL-STD-1553",1000000,"MIL-STD-1553",1000000,"MIL-STD-1553",1000000,"MIL-STD-1553",1000000,"MIL-STD-1553",1000000,"MIL-STD-1553",1000000,"MIL-STD-1553",1000000,"MIL-STD-1553",1000000,"MIL-STD-1553",1000000,"MIL-STD-1553",1000000,"MIL-STD-1553",1000000,"MIL-STD-1553",1000000,"MIL-STD-1553",1000000,"MIL-STD-1553",1000000,"MIL-STD-1553",1000000,"MIL-STD-1553",1000000,"MIL-STD-1553",1000000,"MIL-STD-1553",1000000,"MIL-STD-1553",1000000,"MIL-STD-1553",1000000,"MIL-STD-1553",1000000,"MIL-STD-1553",1000000,"MIL-STD-1553",1000000,"MIL-STD-1553",1000000,"MIL-STD-1553",1000000,"MIL-STD-1553",1000000,"MIL-STD-1553",1000000,"MIL-STD-1553",1000000,"MIL-STD-1553",1000000,"MIL-STD-1553",1000000,"MIL-STD-1553",1000000,"MIL-STD-1553",1000000,"MIL-STD-1553",1000000,"MIL-STD-1553",1000000,"MIL-STD-1553",1000000,"MIL-STD-1553",1000000,"MIL-STD-1553",1000000,"MIL-STD-1553",1000000,"MIL-STD-1553",1000000,"MIL-STD-1553",1000000,"MIL-STD-1553",1000000,"MIL-STD-1553",1000000,"MIL-STD-1553",1000000,"MIL-STD-1553",1000000,"MIL-STD-1553",1000000,"MIL-STD-1553",1000000,"MIL-STD-1553",1000000,"MIL-STD-1553",1000000,"MIL-STD-1553",1000000,"MIL-STD-1553",1000000,"MIL-STD-1553",1000000,"MIL-STD-1553",1000000,"MIL-STD-1553",1000000,"MIL-STD-1553",1000000,"MIL-STD-1553",1000000,"MIL-STD-1553",1000000,"MIL-STD-1553",1000000,"MIL-STD-1553",1000000,"MIL-STD-1553",1000000,"MIL-STD-1553",1000000,"MIL-STD-1553",1000000,"MIL-STD-1553",1000000,"MIL-STD-1553",1000000,"MIL-STD-1553",1000000,"MIL-STD-1553",1000000,"MIL-STD-1553",1000000,"MIL-STD-1553",1000000,"MIL-STD-1553",1000000,"MIL-STD-1553",1000000,"MIL-STD-1553",1000000,"MIL-STD-1553",1000000,"MIL-STD-1553",1000000,"MIL-STD-1553",1000000,"MIL-STD-1553",1000000,"MIL-STD-1553",1000000,"MIL-STD-1553",1000000,"MIL-STD-1553",1000000,"MIL-STD-1553",1000000,"MIL-STD-1553",1000000,"MIL-STD-1553",1000000,"MIL-STD-1553",1000000,"MIL-STD-1553",1000000,"MIL-STD-1553",1000000,"MIL-STD-1553",1000000,"MIL-STD-1553",1000000,"MIL-STD-1553",1000000,"MIL-STD-1553",1000000,"MIL-STD-1553",1000000,"MIL-STD-1553",1000000,"MIL-STD-1553",1000000,"MIL-STD-1553",1000000,"MIL-STD-1553",1000000,"MIL-STD-1553",1000000,"MIL-STD-1553",1000000,"MIL-STD-1553",1000000,"MIL-STD-1553",1000000,"MIL-STD-1553",1000000,"MIL-STD-1553",1000000,"MIL-STD-1553",1000000,"MIL-STD-1553",1000000,"MIL-STD-1553",1000000,"MIL-STD-1553",1000000,"MIL-STD-1553",1000000,"MIL-STD-1553",1000000,"MIL-STD-1553",1000000,"MIL-STD-1553",1000000,"MIL-STD-1553",1000000,"MIL-STD-1553",1000000,"MIL-STD-1553",1000000,"MIL-STD-1553",1000000,"MIL-STD-1553",1000000,"MIL-STD-1553",1000000,"MIL-STD-1553",1000000,"MIL-STD-1553",1000000,"MIL-STD-1553",1000000,"MIL-STD-1553",1000000,"MIL-STD-1553",1000000,"MIL-STD-1553",1000000,"MIL-STD-1553",1000000,"MIL-STD-1553",1000000,"MIL-STD-1553",1000000,"MIL-STD-1553",1000000,"MIL-STD-1553",1000000,"MIL-STD-1553",1000000,"MIL-STD-1553",1000000,"MIL-STD-1553",1000000,"MIL-STD-1553",1000000,"MIL-STD-1553",1000000,"MIL-STD-1553",1000000,"MIL-STD-1553",1000000,"MIL-STD-1553",1000000,"MIL-STD-1553",1000000,"MIL-STD-1553",1000000,"MIL-STD-1553",1000000,"MIL-STD-1553",1000000,"MIL-STD-1553",1000000,"MIL-STD-1553",1000000,"MIL-STD-1553",1000000,"MIL-STD-1553",1000000,"MIL-STD-1553",1000000,"MIL-STD-1553",1000000,"MIL-STD-1553",1000000,"MIL-STD-1553",1000000,"MIL-STD-1553",1000000,"MIL-STD-1553",1000000,"MIL-STD-1553",1000000,"MIL-STD-1553",1000000,"MIL-STD-1553",1000000,"MIL-STD-1553",1000000,"MIL-STD-1553",1000000,"MIL-STD-1553",1000000,"MIL-STD-1553",1000000,"MIL-STD-1553",1000000,"MIL-STD-1553",1000000,"MIL-STD-1553",1000000,"MIL-STD-1553",1000000,"MIL-STD-1553",1000000,"MIL-STD-1553",1000000,"MIL-STD-1553",1000000,"MIL-STD-1553",1000000,"MIL-STD-1553",1000000,"MIL-STD-1553",1000000,"MIL-STD-1553",1000000,"MIL-STD-1553",1000000,"MIL-STD-1553",1000000,"MIL-STD-1553",1000000,"MIL-STD-1553",1000000,"MIL-STD-1553",1000000,"MIL-STD-1553",1000000,"MIL-STD-1553",1000000,"MIL-STD-1553",1000000,"MIL-STD-1553",1000000,"MIL-STD-1553",1000000,"MIL-STD-1553",1000000,"MIL-STD-1553",1000000,"MIL-STD-1553",1000000,"MIL-STD-1553",1000000,"MIL-STD-1553",1000000,"MIL-STD-1553",1000000,"MIL-STD-1553",1000000,"MIL-STD-1553",1000000,"MIL-STD-1553",1000000,"MIL-STD-1553",1000000,"MIL-STD-1553",1000000,"MIL-STD-1553",1000000,"MIL-STD-1553",1000000,"MIL-STD-1553",1000000,"MIL-STD-1553",1000000,"MIL-STD-1553",1000000,"MIL-STD-1553",1000000,"MIL-STD-1553",1000000,"MIL-STD-1553",1000000,"MIL-STD-1553",1000000,"MIL-STD-1553",1000000,"MIL-STD-1553",1000000,"MIL-STD-1553",1000000,"MIL-STD-1553",1000000,"MIL-STD-1553",1000000,"MIL-STD-1553",1000000,"MIL-STD-1553",1000000,"MIL-STD-1553",1000000,"MIL-STD-1553",1000000,"MIL-STD-1553",1000000,"MIL-STD-1553",1000000,"MIL-STD-1553",1000000,"MIL-STD-1553",1000000,"MIL-STD-1553",1000000,"MIL-STD-1553",1000000,"MIL-STD-1553",1000000,"MIL-STD-1553",1000000,"MIL-STD-1553",1000000,"MIL-STD-1553",1000000,"MIL-STD-1553",1000000,"MIL-STD-1553",1000000,"MIL-STD-1553",1000000,"MIL-STD-1553",1000000,"MIL-STD-1553",1000000,"MIL-STD-1553",1000000,"MIL-STD-1553",1000000,"MIL-STD-1553",1000000,"MIL-STD-1553",1000000,"MIL-STD-1553",1000000,"MIL-STD-1553",1000000,"MIL-STD-1553",1000000,"MIL-STD-1553",1000000,"MIL-STD-1553",1000000,"MIL-STD-1553",1000000,"MIL-STD-1553",1000000,"MIL-STD-1553",1000000,"MIL-STD-1553",1000000,"MIL-STD-1553",1000000,"MIL-STD-1553",1000000,"MIL-STD-1553",1000000,"MIL-STD-1553",1000000,"MIL-STD-1553",1000000,"MIL-STD-1553",1000000,"MIL-STD-1553",1000000,"MIL-STD-1553",1000000,"MIL-STD-1553",1000000,"MIL-STD-1553",1000000,"MIL-STD-1553",1000000,"MIL-STD-1553",1000000,"MIL-STD-1553",1000000,"MIL-STD-1553",1000000,"MIL-STD-1553",1000000,"MIL-STD-1553",1000000,"MIL-STD-1553",1000000,"MIL-STD-1553",1000000,"MIL-STD-1553",1000000,"MIL-STD-1553",1000000,"MIL-STD-1553",1000000,"MIL-STD-1553",1000000,"MIL-STD-1553",1000000,"MIL-STD-1553",1000000,"MIL-STD-1553",1000000,"MIL-STD-1553",1000000,"MIL-STD-1553",1000000,"MIL-STD-1553",1000000,"MIL-STD-1553",1000000,"MIL-STD-1553",1000000,"MIL-STD-1553",1000000,"MIL-STD-1553",1000000,"MIL-STD-1553",1000000,"MIL-STD-1553",1000000,"MIL-STD-1553",1000000,"MIL-STD-1553",1000000,"MIL-STD-1553",1000000,"MIL-STD-1553",1000000,"MIL-STD-1553",1000000,"MIL-STD-1553",1000000,"MIL-STD-1553",1000000,"MIL-STD-1553",1000000,"MIL-STD-1553",1000000,"MIL-STD-1553",1000000,"MIL-STD-1553",1000000,"MIL-STD-1553",1000000,"MIL-STD-1553",1000000,"MIL-STD-1553",1000000,"MIL-STD-1553",1000000,"MIL-STD-1553",1000000,"MIL-STD-1553",1000000,"MIL-STD-1553",1000000,"MIL-STD-1553",1000000,"MIL-STD-1553",1000000,"MIL-STD-1553",1000000,"MIL-STD-1553",1000000,"MIL-STD-1553",1000000,"MIL-STD-1553",1000000,"MIL-STD-1553",1000000,"MIL-STD-1553",1000000,"MIL-STD-1553",1000000,"MIL-STD-1553",1000000,"MIL-STD-1553",1000000,"MIL-STD-1553",1000000,"MIL-STD-1553",1000000,"MIL-STD-1553",1000000,"MIL-STD-1553",1000000,"MIL-STD-1553",1000000,"MIL-STD-1553",1000000,"MIL-STD-1553",1000000,"MIL-STD-1553",1000000,"MIL-STD-1553",1000000,"MIL-STD-1553",1000000,"MIL-STD-1553",1000000,"MIL-STD-1553",1000000,"MIL-STD-1553",1000000,"MIL-STD-1553",1000000,"MIL-STD-1553",1000000,"MIL-STD-1553",1000000,"MIL-STD-1553",1000000,"MIL-STD-1553",1000000,"MIL-STD-1553",1000000,"MIL-STD-1553",1000000,"MIL-STD-1553",1000000,"MIL-STD-1553",1000000,"MIL-STD-1553",1000000,"MIL-STD-1553",1000000,"MIL-STD-1553",1000000,"MIL-STD-1553",1000000,"MIL-STD-1553",1000000,"MIL-STD-1553",1000000,"MIL-STD-1553",1000000,"MIL-STD-1553",1000000,"MIL-STD-1553",1000000,"MIL-STD-1553",1000000,"MIL-STD-1553",1000000,"MIL-STD-1553",1000000,"MIL-STD-1553",1000000,"MIL-STD-1553",1000000,"MIL-STD-1553",1000000,"MIL-STD-1553",1000000,"MIL-STD-1553",1000000,"MIL-STD-1553",1000000,"MIL-STD-1553",1000000,"MIL-STD-1553",1000000,"MIL-STD-1553",1000000,"MIL-STD-1553",1000000,"MIL-STD-1553",1000000,"MIL-STD-1553",1000000,"MIL-STD-1553",1000000,"MIL-STD-1553",1000000,"MIL-STD-1553",1000000,"MIL-STD-1553",1000000,"MIL-STD-1553",1000000,"MIL-STD-1553",1000000,"MIL-STD-1553",1000000,"MIL-STD-1553",1000000,"MIL-STD-1553",1000000,"MIL-STD-1553",1000000,"MIL-STD-1553",1000000,"MIL-STD-1553",1000000,"MIL-STD-1553",1000000,"MIL-STD-1553",1000000,"MIL-STD-1553",1000000,"MIL-STD-1553",1000000,"MIL-STD-1553",1000000,"MIL-STD-1553",1000000,"MIL-STD-1553",1000000,"MIL-STD-1553",1000000,"MIL-STD-1553",1000000,"MIL-STD-1553",1000000,"MIL-STD-1553",1000000,"MIL-STD-1553",1000000,"MIL-STD-1553",1000000,"MIL-STD-1553",1000000,"MIL-STD-1553",1000000,"MIL-STD-1553",1000000,"MIL-STD-1553",1000000,"MIL-STD-1553",1000000,"MIL-STD-1553",1000000,"MIL-STD-1553",1000000,"MIL-STD-1553",1000000,"MIL-STD-1553",1000000,"MIL-STD-1553",1000000,"MIL-STD-1553",1000000,"MIL-STD-1553",1000000,"MIL-STD-1553",1000000,"MIL-STD-1553",1000000,"MIL-STD-1553",1000000,"MIL-STD-1553",1000000,"MIL-STD-1553",1000000,"MIL-STD-1553",1000000,"MIL-STD-1553",1000000,"MIL-STD-1553",1000000,"MIL-STD-1553",1000000,"MIL-STD-1553",1000000,"MIL-STD-1553",1000000,"MIL-STD-1553",1000000,"MIL-STD-1553",1000000,"MIL-STD-1553",1000000,"MIL-STD-1553",1000000,"MIL-STD-1553",1000000,"MIL-STD-1553",1000000,"MIL-STD-1553",1000000,"MIL-STD-1553",1000000,"MIL-STD-1553",1000000,"MIL-STD-1553",1000000,"MIL-STD-1553",1000000,"MIL-STD-1553",1000000,"MIL-STD-1553",1000000,"MIL-STD-1553",1000000,"MIL-STD-1553",1000000,"MIL-STD-1553",1000000,"MIL-STD-1553",1000000,"MIL-STD-1553",1000000,"MIL-STD-1553",1000000,"MIL-STD-1553",1000000,"MIL-STD-1553",1000000,"MIL-STD-1553",1000000,"MIL-STD-1553",1000000,"MIL-STD-1553",1000000,"MIL-STD-1553",1000000,"MIL-STD-1553",1000000,"MIL-STD-1553",1000000,"MIL-STD-1553",1000000,"MIL-STD-1553",1000000,"MIL-STD-1553",1000000,"MIL-STD-1553",1000000,"MIL-STD-1553",1000000,"MIL-STD-1553",1000000,"MIL-STD-1553",1000000,"MIL-STD-1553",1000000,"MIL-STD-1553",1000000,"MIL-STD-1553",1000000,"MIL-STD-1553",1000000,"MIL-STD-1553",1000000,"MIL-STD-1553",1000000,"MIL-STD-1553",1000000,"MIL-STD-1553",1000000,"MIL-STD-1553",1000000,"MIL-STD-1553",1000000,"MIL-STD-1553",1000000,"MIL-STD-1553",1000000,"MIL-STD-1553",1000000,"MIL-STD-1553",1000000,"MIL-STD-1553",1000000,"MIL-STD-1553",1000000,"MIL-STD-1553",1000000,"MIL-STD-1553",1000000,"MIL-STD-1553",1000000,"MIL-STD-1553",1000000,"MIL-STD-1553",1000000,"MIL-STD-1553",1000000,"MIL-STD-1553",1000000,"MIL-STD-1553",1000000,"MIL-STD-1553",1000000,"MIL-STD-1553",1000000,"MIL-STD-1553",1000000,"MIL-STD-1553",1000000,"MIL-STD-1553",1000000,"MIL-STD-1553",1000000,"MIL-STD-1553",1000000,"MIL-STD-1553",1000000,"MIL-STD-1553",1000000,"MIL-STD-1553",1000000,"MIL-STD-1553",1000000,"MIL-STD-1553",1000000,"MIL-STD-1553",1000000,"MIL-STD-1553",1000000,"MIL-STD-1553",1000000,"MIL-STD-1553",1000000,"MIL-STD-1553",1000000,"MIL-STD-1553",1000000,"MIL-STD-1553",1000000,"MIL-STD-1553",1000000,"MIL-STD-1553",1000000,"MIL-STD-1553",1000000,"MIL-STD-1553",1000000,"MIL-STD-1553",1000000,"MIL-STD-1553",1000000,"MIL-STD-1553",1000000,"MIL-STD-1553",1000000,"MIL-STD-1553",1000000,"MIL-STD-1553",1000000,"MIL-STD-1553",1000000,"MIL-STD-1553",1000000,"MIL-STD-1553",1000000,"MIL-STD-1553",1000000,"MIL-STD-1553",1000000,"MIL-STD-1553",1000000,"MIL-STD-1553",1000000,"MIL-STD-1553",1000000,"MIL-STD-1553",1000000,"MIL-STD-1553",1000000,"MIL-STD-1553",1000000,"MIL-STD-1553",1000000,"MIL-STD-1553",1000000,"MIL-STD-1553",1000000,"MIL-STD-1553",1000000,"MIL-STD-1553",1000000,"MIL-STD-1553",1000000,"MIL-STD-1553",1000000,"MIL-STD-1553",1000000,"MIL-STD-1553",1000000,"MIL-STD-1553",1000000,"MIL-STD-1553",1000000,"MIL-STD-1553",1000000,"MIL-STD-1553",1000000,"MIL-STD-1553",1000000,"MIL-STD-1553",1000000,"MIL-STD-1553",1000000,"MIL-STD-1553",1000000,"MIL-STD-1553",1000000,"MIL-STD-1553",1000000,"MIL-STD-1553",1000000,"MIL-STD-1553",1000000,"MIL-STD-1553",1000000,"MIL-STD-1553",1000000,"MIL-STD-1553",1000000,"MIL-STD-1553",1000000,"MIL-STD-1553",1000000,"MIL-STD-1553",1000000,"MIL-STD-1553",1000000,"MIL-STD-1553",1000000,"MIL-STD-1553",1000000,"MIL-STD-1553",1000000,"MIL-STD-1553",1000000,"MIL-STD-1553",1000000,"MIL-STD-1553",1000000,"MIL-STD-1553",1000000,"MIL-STD-1553",1000000,"MIL-STD-1553",1000000,"MIL-STD-1553",1000000,"MIL-STD-1553",1000000,"MIL-STD-1553",1000000,"MIL-STD-1553",1000000,"MIL-STD-1553",1000000,"MIL-STD-1553",1000000,"MIL-STD-1553",1000000,"MIL-STD-1553",1000000,"MIL-STD-1553",1000000,"MIL-STD-1553",1000000,"MIL-STD-1553",1000000,"MIL-STD-1553",1000000,"MIL-STD-1553",1000000,"MIL-STD-1553",1000000,"MIL-STD-1553",1000000,"MIL-STD-1553",1000000,"MIL-STD-1553",1000000,"MIL-STD-1553",1000000,"MIL-STD-1553",1000000,"MIL-STD-1553",1000000,"MIL-STD-1553",1000000,"MIL-STD-1553",1000000,"MIL-STD-1553",1000000,"MIL-STD-1553",1000000,"MIL-STD-1553",1000000,"MIL-STD-1553",1000000,"MIL-STD-1553",1000000,"MIL-STD-1553",1000000,"MIL-STD-1553",1000000,"MIL-STD-1553",1000000,"MIL-STD-1553",1000000,"MIL-STD-1553",1000000,"MIL-STD-1553",1000000,"MIL-STD-1553",1000000,"MIL-STD-1553",1000000,"MIL-STD-1553",1000000,"MIL-STD-1553",1000000,"MIL-STD-1553",1000000,"MIL-STD-1553",1000000,"MIL-STD-1553",1000000,"MIL-STD-1553",1000000,"MIL-STD-1553",1000000,"MIL-STD-1553",1000000,"MIL-STD-1553",1000000,"MIL-STD-1553",1000000,"MIL-STD-1553",1000000,"MIL-STD-1553",1000000,"MIL-STD-1553",1000000,"MIL-STD-1553",1000000,"MIL-STD-1553",1000000,"MIL-STD-1553",1000000,"MIL-STD-1553",1000000,"MIL-STD-1553",1000000,"MIL-STD-1553",1000000,"MIL-STD-1553",1000000,"MIL-STD-1553",1000000,"MIL-STD-1553",1000000,"MIL-STD-1553",1000000,"MIL-STD-1553",1000000,"MIL-STD-1553",1000000,"MIL-STD-1553",1000000,"MIL-STD-1553",1000000,"MIL-STD-1553",1000000,"MIL-STD-1553",1000000,"MIL-STD-1553",1000000,"MIL-STD-1553",1000000,"MIL-STD-1553",1000000,"MIL-STD-1553",1000000,"MIL-STD-1553",1000000,"MIL-STD-1553",1000000,"MIL-STD-1553",1000000,"MIL-STD-1553",1000000,"MIL-STD-1553",1000000,"MIL-STD-1553",1000000,"MIL-STD-1553",1000000,"MIL-STD-1553",1000000,"MIL-STD-1553",1000000,"MIL-STD-1553",1000000,"MIL-STD-1553",1000000,"MIL-STD-1553",1000000,"MIL-STD-1553",1000000,"MIL-STD-1553",1000000,"MIL-STD-1553",1000000,"MIL-STD-1553",1000000,"MIL-STD-1553",1000000,"MIL-STD-1553",1000000,"MIL-STD-1553",1000000,"MIL-STD-1553",1000000,"MIL-STD-1553",1000000,"MIL-STD-1553",1000000,"MIL-STD-1553",1000000,"MIL-STD-1553",1000000,"MIL-STD-1553",1000000,"MIL-STD-1553",1000000,"MIL-STD-1553",1000000,"MIL-STD-1553",1000000,"MIL-STD-1553",1000000,"MIL-STD-1553",1000000,"MIL-STD-1553",1000000,"MIL-STD-1553",1000000,"MIL-STD-1553",1000000,"MIL-STD-1553",1000000,"MIL-STD-1553",1000000,"MIL-STD-1553",1000000,"MIL-STD-1553",1000000,"MIL-STD-1553",1000000,"MIL-STD-1553",1000000,"MIL-STD-1553",1000000,"MIL-STD-1553",1000000,"MIL-STD-1553",1000000,"MIL-STD-1553",1000000,"MIL-STD-1553",1000000,"MIL-STD-1553",1000000,"MIL-STD-1553",1000000,"MIL-STD-1553",1000000,"MIL-STD-1553",1000000,"MIL-STD-1553",1000000,"MIL-STD-1553",1000000,"MIL-STD-1553",1000000,"MIL-STD-1553",1000000,"MIL-STD-1553",1000000,"MIL-STD-1553",1000000,"MIL-STD-1553",1000000,"MIL-STD-1553",1000000,"MIL-STD-1553",1000000,"MIL-STD-1553",1000000,"MIL-STD-1553",1000000,"MIL-STD-1553",1000000,"MIL-STD-1553",1000000,"MIL-STD-1553",1000000,"MIL-STD-1553",1000000,"MIL-STD-1553",1000000,"MIL-STD-1553",1000000,"MIL-STD-1553",1000000,"MIL-STD-1553",1000000,"MIL-STD-1553",1000000,"MIL-STD-1553",1000000,"MIL-STD-1553",1000000,"MIL-STD-1553",1000000,"MIL-STD-1553",1000000,"MIL-STD-1553",1000000,"MIL-STD-1553",1000000,"MIL-STD-1553",1000000,"MIL-STD-1553",1000000,"MIL-STD-1553",1000000,"MIL-STD-1553",1000000,"MIL-STD-1553",1000000,"MIL-STD-1553",1000000,"MIL-STD-1553",1000000,"MIL-STD-1553",1000000,"MIL-STD-1553",1000000,"MIL-STD-1553",1000000,"MIL-STD-1553",1000000,"MIL-STD-1553",1000000,"MIL-STD-1553",1000000,"MIL-STD-1553",1000000,"MIL-STD-1553",1000000,"MIL-STD-1553",1000000,"MIL-STD-1553",1000000,"MIL-STD-1553",1000000,"MIL-STD-1553",1000000,"MIL-STD-1553",1000000,"MIL-STD-1553",1000000,"MIL-STD-1553",1000000,"MIL-STD-1553",1000000,"MIL-STD-1553",1000000,"MIL-STD-1553",1000000,"MIL-STD-1553",1000000,"MIL-STD-1553",1000000,"MIL-STD-1553",1000000,"MIL-STD-1553",1000000,"MIL-STD-1553",1000000,"MIL-STD-1553",1000000,"MIL-STD-1553",1000000,"MIL-STD-1553",1000000,"MIL-STD-1553",1000000,"MIL-STD-1553",1000000,"MIL-STD-1553",1000000,"MIL-STD-1553",1000000,"MIL-STD-1553",1000000,"MIL-STD-1553",1000000,"MIL-STD-1553",1000000,"MIL-STD-1553",1000000,"MIL-STD-1553",1000000,"MIL-STD-1553",1000000,"MIL-STD-1553",1000000,"MIL-STD-1553",1000000,"MIL-STD-1553",1000000,"MIL-STD-1553",1000000,"MIL-STD-1553",1000000,"MIL-STD-1553",1000000,"MIL-STD-1553",1000000,"MIL-STD-1553",1000000,"MIL-STD-1553",1000000,"MIL-STD-1553",1000000,"MIL-STD-1553",1000000,"MIL-STD-1553",1000000,"MIL-STD-1553",1000000,"MIL-STD-1553",1000000,"MIL-STD-1553",1000000,"MIL-STD-1553",1000000,"MIL-STD-1553",1000000,"MIL-STD-1553",1000000,"MIL-STD-1553",1000000,"MIL-STD-1553",1000000,"MIL-STD-1553",1000000,"MIL-STD-1553",1000000,"MIL-STD-1553",1000000,"MIL-STD-1553",1000000,"MIL-STD-1553",1000000,"MIL-STD-1553",1000000,"MIL-STD-1553",1000000,"MIL-STD-1553",1000000,"MIL-STD-1553",1000000,"MIL-STD-1553",1000000,"MIL-STD-1553",1000000,"MIL-STD-1553",1000000,"MIL-STD-1553",1000000,"MIL-STD-1553",1000000,"MIL-STD-1553",1000000,"MIL-STD-1553",1000000,"MIL-STD-1553",1000000,"MIL-STD-1553",1000000,"MIL-STD-1553",1000000,"MIL-STD-1553",1000000,"MIL-STD-1553",1000000,"MIL-STD-1553",1000000,"MIL-STD-1553",1000000,"MIL-STD-1553",1000000,"MIL-STD-1553",1000000,"MIL-STD-1553",1000000,"MIL-STD-1553",1000000,"MIL-STD-1553",1000000,"MIL-STD-1553",1000000,"MIL-STD-1553",1000000,"MIL-STD-1553",1000000,"MIL-STD-1553",1000000,"MIL-STD-1553",1000000,"MIL-STD-1553",1000000,"MIL-STD-1553",1000000,"MIL-STD-1553",1000000,"MIL-STD-1553",1000000,"MIL-STD-1553",1000000,"MIL-STD-1553",1000000,"MIL-STD-1553",1000000,"MIL-STD-1553",1000000,"MIL-STD-1553",1000000,"MIL-STD-1553",1000000,"MIL-STD-1553",1000000,"MIL-STD-1553",1000000,"MIL-STD-1553",1000000,"MIL-STD-1553",1000000,"MIL-STD-1553",1000000,"MIL-STD-1553",1000000,"MIL-STD-1553",1000000,"MIL-STD-1553",1000000,"MIL-STD-1553",1000000,"MIL-STD-1553",1000000,"MIL-STD-1553",1000000,"MIL-STD-1553",1000000,"MIL-STD-1553",1000000,"MIL-STD-1553",1000000,"MIL-STD-1553",1000000,"MIL-STD-1553",1000000,"MIL-STD-1553",1000000,"MIL-STD-1553",1000000,"MIL-STD-1553",1000000,"MIL-STD-1553",1000000,"MIL-STD-1553",1000000,"MIL-STD-1553",1000000,"MIL-STD-1553",1000000,"MIL-STD-1553",1000000,"MIL-STD-1553",1000000,"MIL-STD-1553",1000000,"MIL-STD-1553",1000000,"MIL-STD-1553",1000000,"MIL-STD-1553",1000000,"MIL-STD-1553",1000000,"MIL-STD-1553",1000000,"MIL-STD-1553",1000000,"MIL-STD-1553",1000000,"MIL-STD-1553",1000000,"MIL-STD-1553",1000000,"MIL-STD-1553",1000000,"MIL-STD-1553",1000000,"MIL-STD-1553",1000000,"MIL-STD-1553",1000000,"MIL-STD-1553",1000000,"MIL-STD-1553",1000000,"MIL-STD-1553",1000000,"MIL-STD-1553",1000000,"MIL-STD-1553",1000000,"MIL-STD-1553",1000000,"MIL-STD-1553",1000000,"MIL-STD-1553",1000000,"MIL-STD-1553",1000000,"MIL-STD-1553",1000000,"MIL-STD-1553",1000000,"MIL-STD-1553",1000000,"MIL-STD-1553",1000000,"MIL-STD-1553",1000000,"MIL-STD-1553",1000000,"MIL-STD-1553",1000000,"MIL-STD-1553",1000000,"MIL-STD-1553",1000000,"MIL-STD-1553",1000000,"MIL-STD-1553",1000000,"MIL-STD-1553",1000000,"MIL-STD-1553",1000000,"MIL-STD-1553",1000000,"MIL-STD-1553",1000000,"MIL-STD-1553",1000000,"MIL-STD-1553",1000000,"MIL-STD-1553",1000000,"MIL-STD-1553",1000000,"MIL-STD-1553",1000000,"MIL-STD-1553",1000000,"MIL-STD-1553",1000000,"MIL-STD-1553",1000000,"MIL-STD-1553",1000000,"MIL-STD-1553",1000000,"MIL-STD-1553",1000000,"MIL-STD-1553",1000000,"MIL-STD-1553",1000000,"MIL-STD-1553",1000000,"MIL-STD-1553",1000000,"MIL-STD-1553",1000000,"MIL-STD-1553",1000000,"MIL-STD-1553",1000000,"MIL-STD-1553",1000000,"MIL-STD-1553",1000000,"MIL-STD-1553",1000000,"MIL-STD-1553",1000000,"MIL-STD-1553",1000000,"MIL-STD-1553",1000000,"MIL-STD-1553",1000000,"MIL-STD-1553",1000000,"MIL-STD-1553",1000000,"MIL-STD-1553",1000000,"MIL-STD-1553",1000000,"MIL-STD-1553",1000000,"MIL-STD-1553",1000000,"MIL-STD-1553",1000000,"MIL-STD-1553",1000000,"MIL-STD-1553",1000000,"MIL-STD-1553",1000000,"MIL-STD-1553",1000000,"MIL-STD-1553",1000000,"MIL-STD-1553",1000000,"MIL-STD-1553",1000000,"MIL-STD-1553",1000000,"MIL-STD-1553",1000000,"MIL-STD-1553",1000000,"MIL-STD-1553",1000000,"MIL-STD-1553",1000000,"MIL-STD-1553",1000000,"MIL-STD-1553",1000000,"MIL-STD-1553",1000000,"MIL-STD-1553",1000000,"MIL-STD-1553",1000000,"MIL-STD-1553",1000000,"MIL-STD-1553",1000000,"MIL-STD-1553",1000000,"MIL-STD-1553",1000000,"MIL-STD-1553",1000000,"MIL-STD-1553",1000000,"MIL-STD-1553",1000000,"MIL-STD-1553",1000000,"MIL-STD-1553",1000000,"MIL-STD-1553",1000000,"MIL-STD-1553",1000000,"MIL-STD-1553",1000000,"MIL-STD-1553",1000000,"MIL-STD-1553",1000000,"MIL-STD-1553",1000000,"MIL-STD-1553",1000000,"MIL-STD-1553",1000000,"MIL-STD-1553",1000000,"MIL-STD-1553",1000000,"MIL-STD-1553",1000000,"MIL-STD-1553",1000000,"MIL-STD-1553",1000000,"MIL-STD-1553",1000000,"MIL-STD-1553",1000000,"MIL-STD-1553",1000000,"MIL-STD-1553",1000000,"MIL-STD-1553",1000000,"MIL-STD-1553",1000000,"MIL-STD-1553",1000000,"MIL-STD-1553",1000000,"MIL-STD-1553",1000000,"MIL-STD-1553",1000000,"MIL-STD-1553",1000000,"MIL-STD-1553",1000000,"MIL-STD-1553",1000000,"MIL-STD-1553",1000000,"MIL-STD-1553",1000000,"MIL-STD-1553",1000000,"MIL-STD-1553",1000000,"MIL-STD-1553",1000000,"MIL-STD-1553",1000000,"MIL-STD-1553",1000000,"MIL-STD-1553",1000000,"MIL-STD-1553",1000000,"MIL-STD-1553",1000000,"MIL-STD-1553",1000000,"MIL-STD-1553",1000000,"MIL-STD-1553",1000000,"MIL-STD-1553",1000000,"MIL-STD-1553",1000000,"MIL-STD-1553",1000000,"MIL-STD-1553",1000000,"MIL-STD-1553",1000000,"MIL-STD-1553",1000000,"MIL-STD-1553",1000000,"MIL-STD-1553",1000000,"MIL-STD-1553",1000000,"MIL-STD-1553",1000000,"MIL-STD-1553",1000000,"MIL-STD-1553",1000000,"MIL-STD-1553",1000000,"MIL-STD-1553",1000000,"MIL-STD-1553",1000000,"MIL-STD-1553",1000000,"MIL-STD-1553",1000000,"MIL-STD-1553",1000000,"MIL-STD-1553",1000000,"MIL-STD-1553",1000000,"MIL-STD-1553",1000000,"MIL-STD-1553",1000000,"MIL-STD-1553",1000000,"MIL-STD-1553",1000000,"MIL-STD-1553",1000000,"MIL-STD-1553",1000000,"MIL-STD-1553",1000000,"MIL-STD-1553",1000000,"MIL-STD-1553",1000000,"MIL-STD-1553",1000000,"MIL-STD-1553",1000000,"MIL-STD-1553",1000000,"MIL-STD-1553",1000000,"MIL-STD-1553",1000000,"MIL-STD-1553",1000000,"MIL-STD-1553",1000000,"MIL-STD-1553",1000000,"MIL-STD-1553",1000000,"MIL-STD-1553",1000000,"MIL-STD-1553",1000000,"MIL-STD-1553",1000000,"MIL-STD-1553",1000000,"MIL-STD-1553",1000000,"MIL-STD-1553",1000000,"MIL-STD-1553",1000000,"MIL-STD-1553",1000000,"MIL-STD-1553",1000000,"MIL-STD-1553",1000000,"MIL-STD-1553",1000000,"MIL-STD-1553",1000000,"MIL-STD-1553",1000000,"MIL-STD-1553",1000000,"MIL-STD-1553",1000000,"MIL-STD-1553",1000000,"MIL-STD-1553",1000000,"MIL-STD-1553",1000000,"MIL-STD-1553",1000000,"MIL-STD-1553",1000000,"MIL-STD-1553",1000000,"MIL-STD-1553",1000000,"MIL-STD-1553",1000000,"MIL-STD-1553",1000000,"MIL-STD-1553",1000000,"MIL-STD-1553",1000000,"MIL-STD-1553",1000000,"MIL-STD-1553",1000000,"MIL-STD-1553",1000000,"MIL-STD-1553",1000000,"MIL-STD-1553",1000000,"MIL-STD-1553",1000000,"MIL-STD-1553",1000000,"MIL-STD-1553",1000000,"MIL-STD-1553",1000000,"MIL-STD-1553",1000000,"MIL-STD-1553",1000000,"MIL-STD-1553",1000000,"MIL-STD-1553",1000000,"MIL-STD-1553",1000000,"MIL-STD-1553",1000000,"MIL-STD-1553",1000000,"MIL-STD-1553",1000000,"MIL-STD-1553",1000000,"MIL-STD-1553",1000000,"MIL-STD-1553",1000000,"MIL-STD-1553",1000000,"MIL-STD-1553",1000000,"MIL-STD-1553",1000000,"MIL-STD-1553",1000000,"MIL-STD-1553",1000000,"MIL-STD-1553",1000000,"MIL-STD-1553",1000000,"MIL-STD-1553",1000000,"MIL-STD-1553",1000000,"MIL-STD-1553",1000000,"MIL-STD-1553",1000000,"MIL-STD-1553",1000000,"MIL-STD-1553",1000000,"MIL-STD-1553",1000000,"MIL-STD-1553",1000000,"MIL-STD-1553",1000000,"MIL-STD-1553",1000000,"MIL-STD-1553",1000000,"MIL-STD-1553",1000000,"MIL-STD-1553",1000000,"MIL-STD-1553",1000000,"MIL-STD-1553",1000000,"MIL-STD-1553",1000000,"MIL-STD-1553",1000000,"MIL-STD-1553",1000000,"MIL-STD-1553",1000000,"MIL-STD-1553",1000000,"MIL-STD-1553",1000000,"MIL-STD-1553",1000000,"MIL-STD-1553",1000000,"MIL-STD-1553",1000000,"MIL-STD-1553",1000000,"MIL-STD-1553",1000000,"MIL-STD-1553",1000000,"MIL-STD-1553",1000000,"MIL-STD-1553",1000000,"MIL-STD-1553",1000000,"MIL-STD-1553",1000000,"MIL-STD-1553",1000000,"MIL-STD-1553",1000000,"MIL-STD-1553",1000000,"MIL-STD-1553",1000000,"MIL-STD-1553",1000000,"MIL-STD-1553",1000000,"MIL-STD-1553",1000000,"MIL-STD-1553",1000000,"MIL-STD-1553",1000000,"MIL-STD-1553",1000000,"MIL-STD-1553",1000000,"MIL-STD-1553",1000000,"MIL-STD-1553",1000000,"MIL-STD-1553",1000000,"MIL-STD-1553",1000000,"MIL-STD-1553",1000000,"MIL-STD-1553",1000000,"MIL-STD-1553",1000000,"MIL-STD-1553",1000000,"MIL-STD-1553",1000000,"MIL-STD-1553",1000000,"MIL-STD-1553",1000000,"MIL-STD-1553",1000000,"MIL-STD-1553",1000000,"MIL-STD-1553",1000000,"MIL-STD-1553",1000000,"MIL-STD-1553",1000000,"MIL-STD-1553",1000000,"MIL-STD-1553",1000000,"MIL-STD-1553",1000000,"MIL-STD-1553",1000000,"MIL-STD-1553",1000000,"MIL-STD-1553",1000000,"MIL-STD-1553",1000000,"MIL-STD-1553",1000000,"MIL-STD-1553",1000000,"MIL-STD-1553",1000000,"MIL-STD-1553",1000000,"MIL-STD-1553",1000000,"MIL-STD-1553",1000000,"MIL-STD-1553",1000000,"MIL-STD-1553",1000000,"MIL-STD-1553",1000000,"MIL-STD-1553",1000000,"MIL-STD-1553",1000000,"MIL-STD-1553",1000000,"MIL-STD-1553",1000000,"MIL-STD-1553",1000000,"MIL-STD-1553",1000000,"MIL-STD-1553",1000000,"MIL-STD-1553",1000000,"MIL-STD-1553",1000000,"MIL-STD-1553",1000000,"MIL-STD-1553",1000000,"MIL-STD-1553",1000000,"MIL-STD-1553",1000000,"MIL-STD-1553",1000000,"MIL-STD-1553",1000000,"MIL-STD-1553",1000000,"MIL-STD-1553",1000000,"MIL-STD-1553",1000000,"MIL-STD-1553",1000000,"MIL-STD-1553",1000000,"MIL-STD-1553",1000000,"MIL-STD-1553",1000000,"MIL-STD-1553",1000000,"MIL-STD-1553",1000000,"MIL-STD-1553",1000000,"MIL-STD-1553",1000000,"MIL-STD-1553",1000000,"MIL-STD-1553",1000000,"MIL-STD-1553",1000000,"MIL-STD-1553",1000000,"MIL-STD-1553",1000000,"MIL-STD-1553",1000000,"MIL-STD-1553",1000000,"MIL-STD-1553",1000000,"MIL-STD-1553",1000000,"MIL-STD-1553",1000000,"MIL-STD-1553",1000000,"MIL-STD-1553",1000000,"MIL-STD-1553",1000000,"MIL-STD-1553",1000000,"MIL-STD-1553",1000000,"MIL-STD-1553",1000000,"MIL-STD-1553",1000000,"MIL-STD-1553",1000000,"MIL-STD-1553",1000000,"MIL-STD-1553",1000000,"MIL-STD-1553",1000000,"MIL-STD-1553",1000000,"MIL-STD-1553",1000000,"MIL-STD-1553",1000000,"MIL-STD-1553",1000000,"MIL-STD-1553",1000000,"MIL-STD-1553",1000000,"MIL-STD-1553",1000000,"MIL-STD-1553",1000000,"MIL-STD-1553",1000000,"MIL-STD-1553",1000000,"MIL-STD-1553",1000000,"MIL-STD-1553",1000000,"MIL-STD-1553",1000000,"MIL-STD-1553",1000000,"MIL-STD-1553",1000000,"MIL-STD-1553",1000000,"MIL-STD-1553",1000000,"MIL-STD-1553",1000000,"MIL-STD-1553",1000000,"MIL-STD-1553",1000000,"MIL-STD-1553",1000000,"MIL-STD-1553",1000000,"MIL-STD-1553",1000000,"MIL-STD-1553",1000000,"MIL-STD-1553",1000000,"MIL-STD-1553",1000000,"MIL-STD-1553",1000000,"MIL-STD-1553",1000000,"MIL-STD-1553",1000000,"MIL-STD-1553",1000000,"MIL-STD-1553",1000000,"MIL-STD-1553",1000000,"MIL-STD-1553",1000000,"MIL-STD-1553",1000000,"MIL-STD-1553",1000000,"MIL-STD-1553",1000000,"MIL-STD-1553",1000000,"MIL-STD-1553",1000000,"MIL-STD-1553",1000000,"MIL-STD-1553",1000000,"MIL-STD-1553",1000000,"MIL-STD-1553",1000000,"MIL-STD-1553",1000000,"MIL-STD-1553",1000000,"MIL-STD-1553",1000000,"MIL-STD-1553",1000000,"MIL-STD-1553",1000000,"MIL-STD-1553",1000000,"MIL-STD-1553",1000000,"MIL-STD-1553",1000000,"MIL-STD-1553",1000000,"MIL-STD-1553",1000000,"MIL-STD-1553",1000000,"MIL-STD-1553",1000000,"MIL-STD-1553",1000000,"MIL-STD-1553",1000000,"MIL-STD-1553",1000000,"MIL-STD-1553",1000000,"MIL-STD-1553",1000000,"MIL-STD-1553",1000000,"MIL-STD-1553",1000000,"MIL-STD-1553",1000000,"MIL-STD-1553",1000000,"MIL-STD-1553",1000000,"MIL-STD-1553",1000000,"MIL-STD-1553",1000000,"MIL-STD-1553",1000000,"MIL-STD-1553",1000000,"MIL-STD-1553",1000000,"MIL-STD-1553",1000000,"MIL-STD-1553",1000000,"MIL-STD-1553",1000000,"MIL-STD-1553",1000000,"MIL-STD-1553",1000000,"MIL-STD-1553",1000000,"MIL-STD-1553",1000000,"MIL-STD-1553",1000000,"MIL-STD-1553",1000000,"MIL-STD-1553",1000000,"MIL-STD-1553",1000000,"MIL-STD-1553",1000000,"MIL-STD-1553",1000000,"MIL-STD-1553",1000000,"MIL-STD-1553",1000000,"MIL-STD-1553",1000000,"MIL-STD-1553",1000000,"MIL-STD-1553",1000000,"MIL-STD-1553",1000000,"MIL-STD-1553",1000000,"MIL-STD-1553",1000000,"MIL-STD-1553",1000000,"MIL-STD-1553",1000000,"MIL-STD-1553",1000000,"MIL-STD-1553",1000000,"MIL-STD-1553",1000000,"MIL-STD-1553",1000000,"MIL-STD-1553",1000000,"MIL-STD-1553",1000000,"MIL-STD-1553",1000000,"MIL-STD-1553",1000000,"MIL-STD-1553",1000000,"MIL-STD-1553",1000000,"MIL-STD-1553",1000000,"MIL-STD-1553",1000000,"MIL-STD-1553",1000000,"MIL-STD-1553",1000000,"MIL-STD-1553",1000000,"MIL-STD-1553",1000000,"MIL-STD-1553",1000000,"MIL-STD-1553",1000000,"MIL-STD-1553",1000000,"MIL-STD-1553",1000000,"MIL-STD-1553",1000000,"MIL-STD-1553",1000000,"MIL-STD-1553",1000000,"MIL-STD-1553",1000000,"MIL-STD-1553",1000000,"MIL-STD-1553",1000000,"MIL-STD-1553",1000000,"MIL-STD-1553",1000000,"MIL-STD-1553",1000000,"MIL-STD-1553",1000000,"MIL-STD-1553",1000000,"MIL-STD-1553",1000000,"MIL-STD-1553",1000000,"MIL-STD-1553",1000000,"MIL-STD-1553",1000000,"MIL-STD-1553",1000000,"MIL-STD-1553",1000000,"MIL-STD-1553",1000000,"MIL-STD-1553",1000000,"MIL-STD-1553",1000000,"MIL-STD-1553",1000000,"MIL-STD-1553",1000000,"MIL-STD-1553",1000000,"MIL-STD-1553",1000000,"MIL-STD-1553",1000000,"MIL-STD-1553",1000000,"MIL-STD-1553",1000000,"MIL-STD-1553",1000000,"MIL-STD-1553",1000000,"MIL-STD-1553",1000000,"MIL-STD-1553",1000000,"MIL-STD-1553",1000000,"MIL-STD-1553",1000000,"MIL-STD-1553",1000000,"MIL-STD-1553",1000000,"MIL-STD-1553",1000000,"MIL-STD-1553",1000000,"MIL-STD-1553",1000000,"MIL-STD-1553",1000000,"MIL-STD-1553",1000000,"MIL-STD-1553",1000000,"MIL-STD-1553",1000000,"MIL-STD-1553",1000000,"MIL-STD-1553",1000000,"MIL-STD-1553",1000000,"MIL-STD-1553",1000000,"MIL-STD-1553",1000000,"MIL-STD-1553",1000000,"MIL-STD-1553",1000000,"MIL-STD-1553",1000000,"MIL-STD-1553",1000000,"MIL-STD-1553",1000000,"MIL-STD-1553",1000000,"MIL-STD-1553",1000000,"MIL-STD-1553",1000000,"MIL-STD-1553",1000000,"MIL-STD-1553",1000000,"MIL-STD-1553",1000000,"MIL-STD-1553",1000000,"MIL-STD-1553",1000000,"MIL-STD-1553",1000000,"MIL-STD-1553",1000000,"MIL-STD-1553",1000000,"MIL-STD-1553",1000000,"MIL-STD-1553",1000000,"MIL-STD-1553",1000000,"MIL-STD-1553",1000000,"MIL-STD-1553",1000000,"MIL-STD-1553",1000000,"MIL-STD-1553",1000000,"MIL-STD-1553",1000000,"MIL-STD-1553",1000000,"MIL-STD-1553",1000000,"MIL-STD-1553",1000000,"MIL-STD-1553",1000000,"MIL-STD-1553",1000000,"MIL-STD-1553",1000000,"MIL-STD-1553",1000000,"MIL-STD-1553",1000000,"MIL-STD-1553",1000000,"MIL-STD-1553",1000000,"MIL-STD-1553",1000000,"MIL-STD-1553",1000000,"MIL-STD-1553",1000000,"MIL-STD-1553",1000000,"MIL-STD-1553",1000000,"MIL-STD-1553",1000000,"MIL-STD-1553",1000000,"MIL-STD-1553",1000000,"MIL-STD-1553",1000000,"MIL-STD-1553",1000000,"MIL-STD-1553",1000000,"MIL-STD-1553",1000000,"MIL-STD-1553",1000000,"MIL-STD-1553",1000000,"MIL-STD-1553",1000000,"MIL-STD-1553",1000000,"MIL-STD-1553",1000000,"MIL-STD-1553",1000000,"MIL-STD-1553",1000000,"MIL-STD-1553",1000000,"MIL-STD-1553",1000000,"MIL-STD-1553",1000000,"MIL-STD-1553",1000000,"MIL-STD-1553",1000000,"MIL-STD-1553",1000000,"MIL-STD-1553",1000000,"MIL-STD-1553",1000000,"MIL-STD-1553",1000000,"MIL-STD-1553",1000000,"MIL-STD-1553",1000000,"MIL-STD-1553",1000000,"MIL-STD-1553",1000000,"MIL-STD-1553",1000000,"MIL-STD-1553",1000000,"MIL-STD-1553",1000000,"MIL-STD-1553",1000000,"MIL-STD-1553",1000000,"MIL-STD-1553",1000000,"MIL-STD-1553",1000000,"MIL-STD-1553",1000000,"MIL-STD-1553",1000000,"MIL-STD-1553",1000000,"MIL-STD-1553",1000000,"MIL-STD-1553",1000000,"MIL-STD-1553",1000000,"MIL-STD-1553",1000000,"MIL-STD-1553",1000000,"MIL-STD-1553",1000000,"MIL-STD-1553",1000000,"MIL-STD-1553",1000000,"MIL-STD-1553",1000000,"MIL-STD-1553",1000000,"MIL-STD-1553",1000000,"MIL-STD-1553",1000000,"MIL-STD-1553",1000000,"MIL-STD-1553",1000000,"MIL-STD-1553",1000000,"MIL-STD-1553",1000000,"MIL-STD-1553",1000000,"MIL-STD-1553",1000000,"MIL-STD-1553",1000000,"MIL-STD-1553",1000000,"MIL-STD-1553",1000000,"MIL-STD-1553",1000000,"MIL-STD-1553",1000000,"MIL-STD-1553",1000000,"MIL-STD-1553",1000000,"MIL-STD-1553",1000000,"MIL-STD-1553",1000000,"MIL-STD-1553",1000000,"MIL-STD-1553",1000000,"MIL-STD-1553",1000000,"MIL-STD-1553",1000000,"MIL-STD-1553",1000000,"MIL-STD-1553",1000000,"MIL-STD-1553",1000000,"MIL-STD-1553",1000000,"MIL-STD-1553",1000000,"MIL-STD-1553",1000000,"MIL-STD-1553",1000000,"MIL-STD-1553",1000000,"MIL-STD-1553",1000000,"MIL-STD-1553",1000000,"MIL-STD-1553",1000000,"MIL-STD-1553",1000000,"MIL-STD-1553",1000000,"MIL-STD-1553",1000000,"MIL-STD-1553",1000000,"MIL-STD-1553",1000000,"MIL-STD-1553",1000000,"MIL-STD-1553",1000000,"MIL-STD-1553",1000000,"MIL-STD-1553",1000000,"MIL-STD-1553",1000000,"MIL-STD-1553",1000000,"MIL-STD-1553",1000000,"MIL-STD-1553",1000000,"MIL-STD-1553",1000000,"MIL-STD-1553",1000000,"MIL-STD-1553",1000000,"MIL-STD-1553",1000000,"MIL-STD-1553",1000000,"MIL-STD-1553",1000000,"MIL-STD-1553",1000000,"MIL-STD-1553",1000000,"MIL-STD-1553",1000000,"MIL-STD-1553",1000000,"MIL-STD-1553",1000000,"MIL-STD-1553",1000000,"MIL-STD-1553",1000000,"MIL-STD-1553",1000000,"MIL-STD-1553",1000000,"MIL-STD-1553",1000000,"MIL-STD-1553",1000000,"MIL-STD-1553",1000000,"MIL-STD-1553",1000000,"MIL-STD-1553",1000000,"MIL-STD-1553",1000000,"MIL-STD-1553",1000000,"MIL-STD-1553",1000000,"MIL-STD-1553",1000000,"MIL-STD-1553",1000000,"MIL-STD-1553",1000000,"MIL-STD-1553",1000000,"MIL-STD-1553",1000000,"MIL-STD-1553",1000000,"MIL-STD-1553",1000000,"MIL-STD-1553",1000000,"MIL-STD-1553",1000000,"MIL-STD-1553",1000000,"MIL-STD-1553",1000000,"MIL-STD-1553",1000000,"MIL-STD-1553",1000000,"MIL-STD-1553",1000000,"MIL-STD-1553",1000000,"MIL-STD-1553",1000000,"MIL-STD-1553",1000000,"MIL-STD-1553",1000000,"MIL-STD-1553",1000000,"MIL-STD-1553",1000000,"MIL-STD-1553",1000000,"MIL-STD-1553",1000000,"MIL-STD-1553",1000000,"MIL-STD-1553",1000000,"MIL-STD-1553",1000000,"MIL-STD-1553",1000000,"MIL-STD-1553",1000000,"MIL-STD-1553",1000000,"MIL-STD-1553",1000000,"MIL-STD-1553",1000000,"MIL-STD-1553",1000000,"MIL-STD-1553",1000000,"MIL-STD-1553",1000000,"MIL-STD-1553",1000000,"MIL-STD-1553",1000000,"MIL-STD-1553",1000000,"MIL-STD-1553",1000000,"MIL-STD-1553",1000000,"MIL-STD-1553",1000000,"MIL-STD-1553",1000000,"MIL-STD-1553",1000000,"MIL-STD-1553",1000000,"MIL-STD-1553",1000000,"MIL-STD-1553",1000000,"MIL-STD-1553",1000000,"MIL-STD-1553",1000000,"MIL-STD-1553",1000000,"MIL-STD-1553",1000000,"MIL-STD-1553",1000000,"MIL-STD-1553",1000000,"MIL-STD-1553",1000000,"MIL-STD-1553",1000000,"MIL-STD-1553",1000000,"MIL-STD-1553",1000000,"MIL-STD-1553",1000000,"MIL-STD-1553",1000000,"MIL-STD-1553",1000000,"MIL-STD-1553",1000000,"MIL-STD-1553",1000000,"MIL-STD-1553",1000000,"MIL-STD-1553",1000000,"MIL-STD-1553",1000000,"MIL-STD-1553",1000000,"MIL-STD-1553",1000000,"MIL-STD-1553",1000000,"MIL-STD-1553",1000000,"MIL-STD-1553",1000000,"MIL-STD-1553",1000000,"MIL-STD-1553",1000000,"MIL-STD-1553",1000000,"MIL-STD-1553",1000000,"MIL-STD-1553",1000000,"MIL-STD-1553",1000000,"MIL-STD-1553",1000000,"MIL-STD-1553",1000000,"MIL-STD-1553",1000000,"MIL-STD-1553",1000000,"MIL-STD-1553",1000000,"MIL-STD-1553",1000000,"MIL-STD-1553",1000000,"MIL-STD-1553",1000000,"MIL-STD-1553",1000000,"MIL-STD-1553",1000000,"MIL-STD-1553",1000000,"MIL-STD-1553",1000000,"MIL-STD-1553",1000000,"MIL-STD-1553",1000000,"MIL-STD-1553",1000000,"MIL-STD-1553",1000000,"MIL-STD-1553",1000000,"MIL-STD-1553",1000000,"MIL-STD-1553",1000000,"MIL-STD-1553",1000000,"MIL-STD-1553",1000000,"MIL-STD-1553",1000000,"MIL-STD-1553",1000000,"MIL-STD-1553",1000000,"MIL-STD-1553",1000000,"MIL-STD-1553",1000000,"MIL-STD-1553",1000000,"MIL-STD-1553",1000000,"MIL-STD-1553",1000000,"MIL-STD-1553",1000000,"MIL-STD-1553",1000000,"MIL-STD-1553",1000000,"MIL-STD-1553",1000000,"MIL-STD-1553",1000000,"MIL-STD-1553",1000000,"MIL-STD-1553",1000000,"MIL-STD-1553",1000000,"MIL-STD-1553",1000000,"MIL-STD-1553",1000000,"MIL-STD-1553",1000000,"MIL-STD-1553",1000000,"MIL-STD-1553",1000000,"MIL-STD-1553",1000000,"MIL-STD-1553",1000000,"MIL-STD-1553",1000000,"MIL-STD-1553",1000000,"MIL-STD-1553",1000000,"MIL-STD-1553",1000000,"MIL-STD-1553",1000000,"MIL-STD-1553",1000000,"MIL-STD-1553",1000000,"MIL-STD-1553",1000000,"MIL-STD-1553",1000000,"MIL-STD-1553",1000000,"MIL-STD-1553",1000000,"MIL-STD-1553",1000000,"MIL-STD-1553",1000000,"MIL-STD-1553",1000000,"MIL-STD-1553",1000000,"MIL-STD-1553",1000000,"MIL-STD-1553",1000000,"MIL-STD-1553",1000000,"MIL-STD-1553",1000000,"MIL-STD-1553",1000000,"MIL-STD-1553",1000000,"MIL-STD-1553",1000000,"MIL-STD-1553",1000000,"MIL-STD-1553",1000000,"MIL-STD-1553",1000000,"MIL-STD-1553",1000000,"MIL-STD-1553",1000000,"MIL-STD-1553",1000000,"MIL-STD-1553",1000000,"MIL-STD-1553",1000000,"MIL-STD-1553",1000000,"MIL-STD-1553",1000000,"MIL-STD-1553",1000000,"MIL-STD-1553",1000000,"MIL-STD-1553",1000000,"MIL-STD-1553",1000000,"MIL-STD-1553",1000000,"MIL-STD-1553",1000000,"MIL-STD-1553",1000000,"MIL-STD-1553",1000000,"MIL-STD-1553",1000000,"MIL-STD-1553",1000000,"MIL-STD-1553",1000000,"MIL-STD-1553",1000000,"MIL-STD-1553",1000000,"MIL-STD-1553",1000000,"MIL-STD-1553",1000000,"MIL-STD-1553",1000000,"MIL-STD-1553",1000000,"MIL-STD-1553",1000000,"MIL-STD-1553",1000000,"MIL-STD-1553",1000000,"MIL-STD-1553",1000000,"MIL-STD-1553",1000000,"MIL-STD-1553",1000000,"MIL-STD-1553",1000000,"MIL-STD-1553",1000000,"MIL-STD-1553",1000000,"MIL-STD-1553",1000000,"MIL-STD-1553",1000000,"MIL-STD-1553",1000000,"MIL-STD-1553",1000000,"MIL-STD-1553",1000000,"MIL-STD-1553",1000000,"MIL-STD-1553",1000000,"MIL-STD-1553",1000000,"MIL-STD-1553",1000000,"MIL-STD-1553",1000000,"MIL-STD-1553",1000000,"MIL-STD-1553",1000000,"MIL-STD-1553",1000000,"MIL-STD-1553",1000000,"MIL-STD-1553",1000000,"MIL-STD-1553",1000000,"MIL-STD-1553",1000000,"MIL-STD-1553",1000000,"MIL-STD-1553",1000000,"MIL-STD-1553",1000000,"MIL-STD-1553",1000000,"MIL-STD-1553",1000000,"MIL-STD-1553",1000000,"MIL-STD-1553",1000000,"MIL-STD-1553",1000000,"MIL-STD-1553",1000000,"MIL-STD-1553",1000000,"MIL-STD-1553",1000000,"MIL-STD-1553",1000000,"MIL-STD-1553",1000000,"MIL-STD-1553",1000000,"MIL-STD-1553",1000000,"MIL-STD-1553",1000000,"MIL-STD-1553",1000000,"MIL-STD-1553",1000000,"MIL-STD-1553",1000000,"MIL-STD-1553",1000000,"MIL-STD-1553",1000000,"MIL-STD-1553",1000000,"MIL-STD-1553",1000000,"MIL-STD-1553",1000000,"MIL-STD-1553",1000000,"MIL-STD-1553",1000000,"MIL-STD-1553",1000000,"MIL-STD-1553",1000000,"MIL-STD-1553",1000000,"MIL-STD-1553",1000000,"MIL-STD-1553",1000000,"MIL-STD-1553",1000000,"MIL-STD-1553",1000000,"MIL-STD-1553",1000000,"MIL-STD-1553",1000000,"MIL-STD-1553",1000000,"MIL-STD-1553",1000000,"MIL-STD-1553",1000000,"MIL-STD-1553",1000000,"MIL-STD-1553",1000000,"MIL-STD-1553",1000000,"MIL-STD-1553",1000000,"MIL-STD-1553",1000000,"MIL-STD-1553",1000000,"MIL-STD-1553",1000000,"MIL-STD-1553",1000000,"MIL-STD-1553",1000000,"MIL-STD-1553",1000000,"MIL-STD-1553",1000000,"MIL-STD-1553",1000000,"MIL-STD-1553",1000000,"MIL-STD-1553",1000000,"MIL-STD-1553",1000000,"MIL-STD-1553",1000000,"MIL-STD-1553",1000000,"MIL-STD-1553",1000000,"MIL-STD-1553",1000000,"MIL-STD-1553",1000000,"MIL-STD-1553",1000000,"MIL-STD-1553",1000000,"MIL-STD-1553",1000000,"MIL-STD-1553",1000000,"MIL-STD-1553",1000000,"MIL-STD-1553",1000000,"MIL-STD-1553",1000000,"MIL-STD-1553",1000000,"MIL-STD-1553",1000000,"MIL-STD-1553",1000000,"MIL-STD-1553",1000000,"MIL-STD-1553",1000000,"MIL-STD-1553",1000000,"MIL-STD-1553",1000000,"MIL-STD-1553",1000000,"MIL-STD-1553",1000000,"MIL-STD-1553",1000000,"MIL-STD-1553",1000000,"MIL-STD-1553",1000000,"MIL-STD-1553",1000000,"MIL-STD-1553",1000000,"MIL-STD-1553",1000000,"MIL-STD-1553",1000000,"MIL-STD-1553",1000000,"MIL-STD-1553",1000000,"MIL-STD-1553",1000000,"MIL-STD-1553",1000000,"MIL-STD-1553",1000000,"MIL-STD-1553",1000000,"MIL-STD-1553",1000000,"MIL-STD-1553",1000000,"MIL-STD-1553",1000000,"MIL-STD-1553",1000000,"MIL-STD-1553",1000000,"MIL-STD-1553",1000000,"MIL-STD-1553",1000000,"MIL-STD-1553",1000000,"MIL-STD-1553",1000000,"MIL-STD-1553",1000000,"MIL-STD-1553",1000000,"MIL-STD-1553",1000000,"MIL-STD-1553",1000000,"MIL-STD-1553",1000000,"MIL-STD-1553",1000000,"MIL-STD-1553",1000000,"MIL-STD-1553",1000000,"MIL-STD-1553",1000000,"MIL-STD-1553",1000000,"MIL-STD-1553",1000000,"MIL-STD-1553",1000000,"MIL-STD-1553",1000000,"MIL-STD-1553",1000000,"MIL-STD-1553",1000000,"MIL-STD-1553",1000000,"MIL-STD-1553",1000000,"MIL-STD-1553",1000000,"MIL-STD-1553",1000000,"MIL-STD-1553",1000000,"MIL-STD-1553",1000000,"MIL-STD-1553",1000000,"MIL-STD-1553",1000000,"MIL-STD-1553",1000000,"MIL-STD-1553",1000000,"MIL-STD-1553",1000000,"MIL-STD-1553",1000000,"MIL-STD-1553",1000000,"MIL-STD-1553",1000000,"MIL-STD-1553",1000000,"MIL-STD-1553",1000000,"MIL-STD-1553",1000000,"MIL-STD-1553",1000000,"MIL-STD-1553",1000000,"MIL-STD-1553",1000000,"MIL-STD-1553",1000000,"MIL-STD-1553",1000000,"MIL-STD-1553",1000000,"MIL-STD-1553",1000000,"MIL-STD-1553",1000000,"MIL-STD-1553",1000000,"MIL-STD-1553",1000000,"MIL-STD-1553",1000000,"MIL-STD-1553",1000000,"MIL-STD-1553",1000000,"MIL-STD-1553",1000000,"MIL-STD-1553",1000000,"MIL-STD-1553",1000000,"MIL-STD-1553",1000000,"MIL-STD-1553",1000000,"MIL-STD-1553",1000000,"MIL-STD-1553",1000000,"MIL-STD-1553",1000000,"MIL-STD-1553",1000000,"MIL-STD-1553",1000000,"MIL-STD-1553",1000000,"MIL-STD-1553",1000000,"MIL-STD-1553",1000000,"MIL-STD-1553",1000000,"MIL-STD-1553",1000000,"MIL-STD-1553",1000000,"MIL-STD-1553",1000000,"MIL-STD-1553",1000000,"MIL-STD-1553",1000000,"MIL-STD-1553",1000000,"MIL-STD-1553",1000000,"MIL-STD-1553",1000000,"MIL-STD-1553",1000000,"MIL-STD-1553",1000000,"MIL-STD-1553",1000000,"MIL-STD-1553",1000000,"MIL-STD-1553",1000000,"MIL-STD-1553",1000000,"MIL-STD-1553",1000000,"MIL-STD-1553",1000000,"MIL-STD-1553",1000000,"MIL-STD-1553",1000000,"MIL-STD-1553",1000000,"MIL-STD-1553",1000000,"MIL-STD-1553",1000000,"MIL-STD-1553",1000000,"MIL-STD-1553",1000000,"MIL-STD-1553",1000000,"MIL-STD-1553",1000000,"MIL-STD-1553",1000000,"MIL-STD-1553",1000000,"MIL-STD-1553",1000000,"MIL-STD-1553",1000000,"MIL-STD-1553",1000000,"MIL-STD-1553",1000000,"MIL-STD-1553",1000000,"MIL-STD-1553",1000000,"MIL-STD-1553",1000000,"MIL-STD-1553",1000000,"MIL-STD-1553",1000000,"MIL-STD-1553",1000000,"MIL-STD-1553",1000000,"MIL-STD-1553",1000000,"MIL-STD-1553",1000000,"MIL-STD-1553",1000000,"MIL-STD-1553",1000000,"MIL-STD-1553",1000000,"MIL-STD-1553",1000000,"MIL-STD-1553",1000000,"MIL-STD-1553",1000000,"MIL-STD-1553",1000000,"MIL-STD-1553",1000000,"MIL-STD-1553",1000000,"MIL-STD-1553",1000000,"MIL-STD-1553",1000000,"MIL-STD-1553",1000000,"MIL-STD-1553",1000000,"MIL-STD-1553",1000000,"MIL-STD-1553",1000000,"MIL-STD-1553",1000000,"MIL-STD-1553",1000000,"MIL-STD-1553",1000000,"MIL-STD-1553",1000000,"MIL-STD-1553",1000000,"MIL-STD-1553",1000000,"MIL-STD-1553",1000000,"MIL-STD-1553",1000000,"MIL-STD-1553",1000000,"MIL-STD-1553",1000000,"MIL-STD-1553",1000000,"MIL-STD-1553",1000000,"MIL-STD-1553",1000000,"MIL-STD-1553",1000000,"MIL-STD-1553",1000000,"MIL-STD-1553",1000000,"MIL-STD-1553",1000000,"MIL-STD-1553",1000000,"MIL-STD-1553",1000000,"MIL-STD-1553",1000000,"MIL-STD-1553",1000000,"MIL-STD-1553",1000000,"MIL-STD-1553",1000000,"MIL-STD-1553",1000000,"MIL-STD-1553",1000000,"MIL-STD-1553",1000000,"MIL-STD-1553",1000000,"MIL-STD-1553",1000000,"MIL-STD-1553",1000000,"MIL-STD-1553",1000000,"MIL-STD-1553",1000000,"MIL-STD-1553",1000000,"MIL-STD-1553",1000000,"MIL-STD-1553",1000000,"MIL-STD-1553",1000000,"MIL-STD-1553",1000000,"MIL-STD-1553",1000000,"MIL-STD-1553",1000000,"MIL-STD-1553",1000000,"MIL-STD-1553",1000000,"MIL-STD-1553",1000000,"MIL-STD-1553",1000000,"MIL-STD-1553",1000000,"MIL-STD-1553",1000000,"MIL-STD-1553",1000000,"MIL-STD-1553",1000000,"MIL-STD-1553",1000000,"MIL-STD-1553",1000000,"MIL-STD-1553",1000000,"MIL-STD-1553",1000000,"MIL-STD-1553",1000000,"MIL-STD-1553",1000000,"MIL-STD-1553",1000000,"MIL-STD-1553",1000000,"MIL-STD-1553",1000000,"MIL-STD-1553",1000000,"MIL-STD-1553",1000000,"MIL-STD-1553",1000000,"MIL-STD-1553",1000000,"MIL-STD-1553",1000000,"MIL-STD-1553",1000000,"MIL-STD-1553",1000000,"MIL-STD-1553",1000000,"MIL-STD-1553",1000000,"MIL-STD-1553",1000000,"MIL-STD-1553",1000000,"MIL-STD-1553",1000000,"MIL-STD-1553",1000000,"MIL-STD-1553",1000000,"MIL-STD-1553",1000000,"MIL-STD-1553",1000000,"MIL-STD-1553",1000000,"MIL-STD-1553",1000000,"MIL-STD-1553",1000000,"MIL-STD-1553",1000000,"MIL-STD-1553",1000000,"MIL-STD-1553",1000000,"MIL-STD-1553",1000000,"MIL-STD-1553",1000000,"MIL-STD-1553",1000000,"MIL-STD-1553",1000000,"MIL-STD-1553",1000000,"MIL-STD-1553",1000000,"MIL-STD-1553",1000000,"MIL-STD-1553",1000000,"MIL-STD-1553",1000000,"MIL-STD-1553",1000000,"MIL-STD-1553",1000000,"MIL-STD-1553",1000000,"MIL-STD-1553",1000000,"MIL-STD-1553",1000000,"MIL-STD-1553",1000000,"MIL-STD-1553",1000000,"MIL-STD-1553",1000000,"MIL-STD-1553",1000000,"MIL-STD-1553",1000000,"MIL-STD-1553",1000000,"MIL-STD-1553",1000000,"MIL-STD-1553",1000000,"MIL-STD-1553",1000000,"MIL-STD-1553",1000000,"MIL-STD-1553",1000000,"MIL-STD-1553",1000000,"MIL-STD-1553",1000000,"MIL-STD-1553",1000000,"MIL-STD-1553",1000000,"MIL-STD-1553",1000000,"MIL-STD-1553",1000000,"MIL-STD-1553",1000000,"MIL-STD-1553",1000000,"MIL-STD-1553",1000000,"MIL-STD-1553",1000000,"MIL-STD-1553",1000000,"MIL-STD-1553",1000000,"MIL-STD-1553",1000000,"MIL-STD-1553",1000000,"MIL-STD-1553",1000000,"MIL-STD-1553",1000000,"MIL-STD-1553",1000000,"MIL-STD-1553",1000000,"MIL-STD-1553",1000000,"MIL-STD-1553",1000000,"MIL-STD-1553",1000000,"MIL-STD-1553",1000000,"MIL-STD-1553",1000000,"MIL-STD-1553",1000000,"MIL-STD-1553",1000000,"MIL-STD-1553",1000000,"MIL-STD-1553",1000000,"MIL-STD-1553",1000000,"MIL-STD-1553",1000000,"MIL-STD-1553",1000000,"MIL-STD-1553",1000000,"MIL-STD-1553",1000000,"MIL-STD-1553",1000000,"MIL-STD-1553",1000000,"MIL-STD-1553",1000000,"MIL-STD-1553",1000000,"MIL-STD-1553",1000000,"MIL-STD-1553",1000000,"MIL-STD-1553",1000000,"MIL-STD-1553",1000000,"MIL-STD-1553",1000000,"MIL-STD-1553",1000000,"MIL-STD-1553",1000000,"MIL-STD-1553",1000000,"MIL-STD-1553",1000000,"MIL-STD-1553",1000000,"MIL-STD-1553",1000000,"MIL-STD-1553",1000000,"MIL-STD-1553",1000000,"MIL-STD-1553",1000000,"MIL-STD-1553",1000000,"MIL-STD-1553",1000000,"MIL-STD-1553",1000000,"MIL-STD-1553",1000000,"MIL-STD-1553",1000000,"MIL-STD-1553",1000000,"MIL-STD-1553",1000000,"MIL-STD-1553",1000000,"MIL-STD-1553",1000000,"MIL-STD-1553",1000000,"MIL-STD-1553",1000000,"MIL-STD-1553",1000000,"MIL-STD-1553",1000000,"MIL-STD-1553",1000000,"MIL-STD-1553",1000000,"MIL-STD-1553",1000000,"MIL-STD-1553",1000000,"MIL-STD-1553",1000000,"MIL-STD-1553",1000000,"MIL-STD-1553",1000000,"MIL-STD-1553",1000000,"MIL-STD-1553",1000000,"MIL-STD-1553",1000000,"MIL-STD-1553",1000000,"MIL-STD-1553",1000000,"MIL-STD-1553",1000000,"MIL-STD-1553",1000000,"MIL-STD-1553",1000000,"MIL-STD-1553",1000000,"MIL-STD-1553",1000000,"MIL-STD-1553",1000000,"MIL-STD-1553",1000000,"MIL-STD-1553",1000000,"MIL-STD-1553",1000000,"MIL-STD-1553",1000000,"MIL-STD-1553",1000000,"MIL-STD-1553",1000000,"MIL-STD-1553",1000000,"MIL-STD-1553",1000000,"MIL-STD-1553",1000000,"MIL-STD-1553",1000000,"MIL-STD-1553",1000000,"MIL-STD-1553",1000000,"MIL-STD-1553",1000000,"MIL-STD-1553",1000000,"MIL-STD-1553",1000000,"MIL-STD-1553",1000000,"MIL-STD-1553",1000000,"MIL-STD-1553",1000000,"MIL-STD-1553",1000000,"MIL-STD-1553",1000000,"MIL-STD-1553",1000000,"MIL-STD-1553",1000000,"MIL-STD-1553",1000000,"MIL-STD-1553",1000000,"MIL-STD-1553",1000000,"MIL-STD-1553",1000000,"MIL-STD-1553",1000000,"MIL-STD-1553",1000000,"MIL-STD-1553",1000000,"MIL-STD-1553",1000000,"MIL-STD-1553",1000000,"MIL-STD-1553",1000000,"MIL-STD-1553",1000000,"MIL-STD-1553",1000000,"MIL-STD-1553",1000000,"MIL-STD-1553",1000000,"MIL-STD-1553",1000000,"MIL-STD-1553",1000000,"MIL-STD-1553",1000000,"MIL-STD-1553",1000000,"MIL-STD-1553",1000000,"MIL-STD-1553",1000000,"MIL-STD-1553",1000000,"MIL-STD-1553",1000000,"MIL-STD-1553",1000000,"MIL-STD-1553",1000000,"MIL-STD-1553",1000000,"MIL-STD-1553",1000000,"MIL-STD-1553",1000000,"MIL-STD-1553",1000000,"MIL-STD-1553",1000000,"MIL-STD-1553",1000000,"MIL-STD-1553",1000000,"MIL-STD-1553",1000000,"MIL-STD-1553",1000000,"MIL-STD-1553",1000000,"MIL-STD-1553",1000000,"MIL-STD-1553",1000000,"MIL-STD-1553",1000000,"MIL-STD-1553",1000000,"MIL-STD-1553",1000000,"MIL-STD-1553",1000000,"MIL-STD-1553",1000000,"MIL-STD-1553",1000000,"MIL-STD-1553",1000000,"MIL-STD-1553",1000000,"MIL-STD-1553",1000000,"MIL-STD-1553",1000000,"MIL-STD-1553",1000000,"MIL-STD-1553",1000000,"MIL-STD-1553",1000000,"MIL-STD-1553",1000000,"MIL-STD-1553",1000000,"MIL-STD-1553",1000000,"MIL-STD-1553",1000000,"MIL-STD-1553",1000000,"MIL-STD-1553",1000000,"MIL-STD-1553",1000000,"MIL-STD-1553",1000000,"MIL-STD-1553",1000000,"MIL-STD-1553",1000000,"MIL-STD-1553",1000000,"MIL-STD-1553",1000000,"MIL-STD-1553",1000000,"MIL-STD-1553",1000000,"MIL-STD-1553",1000000,"MIL-STD-1553",1000000,"MIL-STD-1553",1000000,"MIL-STD-1553",1000000,"MIL-STD-1553",1000000,"MIL-STD-1553",1000000,"MIL-STD-1553",1000000,"MIL-STD-1553",1000000,"MIL-STD-1553",1000000,"MIL-STD-1553",1000000,"MIL-STD-1553",1000000,"MIL-STD-1553",1000000,"MIL-STD-1553",1000000,"MIL-STD-1553",1000000,"MIL-STD-1553",1000000,"MIL-STD-1553",1000000,"MIL-STD-1553",1000000,"MIL-STD-1553",1000000,"MIL-STD-1553",1000000,"MIL-STD-1553",1000000,"MIL-STD-1553",1000000,"MIL-STD-1553",1000000,"MIL-STD-1553",1000000,"MIL-STD-1553",1000000,"MIL-STD-1553",1000000,"MIL-STD-1553",1000000,"MIL-STD-1553",1000000,"MIL-STD-1553",1000000,"MIL-STD-1553",1000000,"MIL-STD-1553",1000000,"MIL-STD-1553",1000000,"MIL-STD-1553",1000000,"MIL-STD-1553",1000000,"MIL-STD-1553",1000000,"MIL-STD-1553",1000000,"MIL-STD-1553",1000000,"MIL-STD-1553",1000000,"MIL-STD-1553",1000000,"MIL-STD-1553",1000000,"MIL-STD-1553",1000000,"MIL-STD-1553",1000000,"MIL-STD-1553",1000000,"MIL-STD-1553",1000000,"MIL-STD-1553",1000000,"MIL-STD-1553",1000000,"MIL-STD-1553",1000000,"MIL-STD-1553",1000000,"MIL-STD-1553",1000000,"MIL-STD-1553",1000000,"MIL-STD-1553",1000000,"MIL-STD-1553",1000000,"MIL-STD-1553",1000000,"MIL-STD-1553",1000000,"MIL-STD-1553",1000000,"MIL-STD-1553",1000000,"MIL-STD-1553",1000000,"MIL-STD-1553",1000000,"MIL-STD-1553",1000000,"MIL-STD-1553",1000000,"MIL-STD-1553",1000000,"MIL-STD-1553",1000000,"MIL-STD-1553",1000000,"MIL-STD-1553",1000000,"MIL-STD-1553",1000000,"MIL-STD-1553",1000000,"MIL-STD-1553",1000000,"MIL-STD-1553",1000000,"MIL-STD-1553",1000000,"MIL-STD-1553",1000000,"MIL-STD-1553",1000000,"MIL-STD-1553",1000000,"MIL-STD-1553",1000000,"MIL-STD-1553",1000000,"MIL-STD-1553",1000000,"MIL-STD-1553",1000000,"MIL-STD-1553",1000000,"MIL-STD-1553",1000000,"MIL-STD-1553",1000000,"MIL-STD-1553",1000000,"MIL-STD-1553",1000000,"MIL-STD-1553",1000000,"MIL-STD-1553",1000000,"MIL-STD-1553",1000000,"MIL-STD-1553",1000000,"MIL-STD-1553",1000000,"MIL-STD-1553",1000000,"MIL-STD-1553",1000000,"MIL-STD-1553",1000000,"MIL-STD-1553",1000000,"MIL-STD-1553",1000000,"MIL-STD-1553",1000000,"MIL-STD-1553",1000000,"MIL-STD-1553",1000000,"MIL-STD-1553",1000000,"MIL-STD-1553",1000000,"MIL-STD-1553",1000000,"MIL-STD-1553",1000000,"MIL-STD-1553",1000000,"MIL-STD-1553",1000000,"MIL-STD-1553",1000000,"MIL-STD-1553",1000000,"MIL-STD-1553",1000000,"MIL-STD-1553",1000000,"MIL-STD-1553",1000000,"MIL-STD-1553",1000000,"MIL-STD-1553",1000000,"MIL-STD-1553",1000000,"MIL-STD-1553",1000000,"MIL-STD-1553",1000000,"MIL-STD-1553",1000000,"MIL-STD-1553",1000000,"MIL-STD-1553",1000000,"MIL-STD-1553",1000000,"MIL-STD-1553",1000000,"MIL-STD-1553",1000000,"MIL-STD-1553",1000000,"MIL-STD-1553",1000000,"MIL-STD-1553",1000000,"MIL-STD-1553",1000000,"MIL-STD-1553",1000000,"MIL-STD-1553",1000000,"MIL-STD-1553",1000000,"MIL-STD-1553",1000000,"MIL-STD-1553",1000000,"MIL-STD-1553",1000000,"MIL-STD-1553",1000000,"MIL-STD-1553",1000000,"MIL-STD-1553",1000000,"MIL-STD-1553",1000000,"MIL-STD-1553",1000000,"MIL-STD-1553",1000000,"MIL-STD-1553",1000000,"MIL-STD-1553",1000000,"MIL-STD-1553",1000000,"MIL-STD-1553",1000000,"MIL-STD-1553",1000000,"MIL-STD-1553",1000000,"MIL-STD-1553",1000000,"MIL-STD-1553",1000000,"MIL-STD-1553",1000000,"MIL-STD-1553",1000000,"MIL-STD-1553",1000000,"MIL-STD-1553",1000000,"MIL-STD-1553",1000000,"MIL-STD-1553",1000000,"MIL-STD-1553",1000000,"MIL-STD-1553",1000000,"MIL-STD-1553",1000000,"MIL-STD-1553",1000000,"MIL-STD-1553",1000000,"MIL-STD-1553",1000000,"MIL-STD-1553",1000000,"MIL-STD-1553",1000000,"MIL-STD-1553",1000000,"MIL-STD-1553",1000000,"MIL-STD-1553",1000000,"MIL-STD-1553",1000000,"MIL-STD-1553",1000000,"MIL-STD-1553",1000000,"MIL-STD-1553",1000000,"MIL-STD-1553",1000000,"MIL-STD-1553",1000000,"MIL-STD-1553",1000000,"MIL-STD-1553",1000000,"MIL-STD-1553",1000000,"MIL-STD-1553",1000000,"MIL-STD-1553",1000000,"MIL-STD-1553",1000000,"MIL-STD-1553",1000000,"MIL-STD-1553",1000000,"MIL-STD-1553",1000000,"MIL-STD-1553",1000000,"MIL-STD-1553",1000000,"MIL-STD-1553",1000000,"MIL-STD-1553",1000000,"MIL-STD-1553",1000000,"MIL-STD-1553",1000000,"MIL-STD-1553",1000000,"MIL-STD-1553",1000000,"MIL-STD-1553",1000000,"MIL-STD-1553",1000000,"MIL-STD-1553",1000000,"MIL-STD-1553",1000000,"MIL-STD-1553",1000000,"MIL-STD-1553",1000000,"MIL-STD-1553",1000000,"MIL-STD-1553",1000000,"MIL-STD-1553",1000000,"MIL-STD-1553",1000000,"MIL-STD-1553",1000000,"MIL-STD-1553",1000000,"MIL-STD-1553",1000000,"MIL-STD-1553",1000000,"MIL-STD-1553",1000000,"MIL-STD-1553",1000000,"MIL-STD-1553",1000000,"MIL-STD-1553",1000000,"MIL-STD-1553",1000000,"MIL-STD-1553",1000000,"MIL-STD-1553",1000000,"MIL-STD-1553",1000000,"MIL-STD-1553",1000000,"MIL-STD-1553",1000000,"MIL-STD-1553",1000000,"MIL-STD-1553",1000000,"MIL-STD-1553",1000000,"MIL-STD-1553",1000000,"MIL-STD-1553",1000000,"MIL-STD-1553",1000000,"MIL-STD-1553",1000000,"MIL-STD-1553",1000000,"MIL-STD-1553",1000000,"MIL-STD-1553",1000000,"MIL-STD-1553",1000000,"MIL-STD-1553",1000000,"MIL-STD-1553",1000000,"MIL-STD-1553",1000000,"MIL-STD-1553",1000000,"MIL-STD-1553",1000000,"MIL-STD-1553",1000000,"MIL-STD-1553",1000000,"MIL-STD-1553",1000000,"MIL-STD-1553",1000000,"MIL-STD-1553",1000000,"MIL-STD-1553",1000000,"MIL-STD-1553",1000000,"MIL-STD-1553",1000000,"MIL-STD-1553",1000000,"MIL-STD-1553",1000000,"MIL-STD-1553",1000000,"MIL-STD-1553",1000000,"MIL-STD-1553",1000000,"MIL-STD-1553",1000000,"MIL-STD-1553",1000000,"MIL-STD-1553",1000000,"MIL-STD-1553",1000000,"MIL-STD-1553",1000000,"MIL-STD-1553",1000000,"MIL-STD-1553",1000000,"MIL-STD-1553",1000000,"MIL-STD-1553",1000000,"MIL-STD-1553",1000000,"MIL-STD-1553",1000000,"MIL-STD-1553",1000000,"MIL-STD-1553",1000000,"MIL-STD-1553",1000000,"MIL-STD-1553",1000000,"MIL-STD-1553",1000000,"MIL-STD-1553",1000000,"MIL-STD-1553",1000000,"MIL-STD-1553",1000000,"MIL-STD-1553",1000000,"MIL-STD-1553",1000000,"MIL-STD-1553",1000000,"MIL-STD-1553",1000000,"MIL-STD-1553",1000000,"MIL-STD-1553",1000000,"MIL-STD-1553",1000000,"MIL-STD-1553",1000000,"MIL-STD-1553",1000000,"MIL-STD-1553",1000000,"MIL-STD-1553",1000000,"MIL-STD-1553",1000000,"MIL-STD-1553",1000000,"MIL-STD-1553",1000000,"MIL-STD-1553",1000000,"MIL-STD-1553",1000000,"MIL-STD-1553",1000000,"MIL-STD-1553",1000000,"MIL-STD-1553",1000000,"MIL-STD-1553",1000000,"MIL-STD-1553",1000000,"MIL-STD-1553",1000000,"MIL-STD-1553",1000000,"MIL-STD-1553",1000000,"MIL-STD-1553",1000000,"MIL-STD-1553",1000000,"MIL-STD-1553",1000000,"MIL-STD-1553",1000000,"MIL-STD-1553",1000000,"MIL-STD-1553",1000000,"MIL-STD-1553",1000000,"MIL-STD-1553",1000000,"MIL-STD-1553",1000000,"MIL-STD-1553",1000000,"MIL-STD-1553",1000000,"MIL-STD-1553",1000000,"MIL-STD-1553",1000000,"MIL-STD-1553",1000000,"MIL-STD-1553",1000000,"MIL-STD-1553",1000000,"MIL-STD-1553",1000000,"MIL-STD-1553",1000000,"MIL-STD-1553",1000000,"MIL-STD-1553",1000000,"MIL-STD-1553",1000000,"MIL-STD-1553",1000000,"MIL-STD-1553",1000000,"MIL-STD-1553",1000000,"MIL-STD-1553",1000000,"MIL-STD-1553",1000000,"MIL-STD-1553",1000000,"MIL-STD-1553",1000000,"MIL-STD-1553",1000000,"MIL-STD-1553",1000000,"MIL-STD-1553",1000000,"MIL-STD-1553",1000000,"MIL-STD-1553",1000000,"MIL-STD-1553",1000000,"MIL-STD-1553",1000000,"MIL-STD-1553",1000000,"MIL-STD-1553",1000000,"MIL-STD-1553",1000000,"MIL-STD-1553",1000000,"MIL-STD-1553",1000000,"MIL-STD-1553",1000000,"MIL-STD-1553",1000000,"MIL-STD-1553",1000000,"MIL-STD-1553",1000000,"MIL-STD-1553",1000000,"MIL-STD-1553",1000000,"MIL-STD-1553",1000000,"MIL-STD-1553",1000000,"MIL-STD-1553",1000000,"MIL-STD-1553",1000000,"MIL-STD-1553",1000000,"MIL-STD-1553",1000000,"MIL-STD-1553",1000000,"MIL-STD-1553",1000000,"MIL-STD-1553",1000000,"MIL-STD-1553",1000000,"MIL-STD-1553",1000000,"MIL-STD-1553",1000000,"MIL-STD-1553",1000000,"MIL-STD-1553",1000000,"MIL-STD-1553",1000000,"MIL-STD-1553",1000000,"MIL-STD-1553",1000000,"MIL-STD-1553",1000000,"MIL-STD-1553",1000000,"MIL-STD-1553",1000000,"MIL-STD-1553",1000000,"MIL-STD-1553",1000000,"MIL-STD-1553",1000000,"MIL-STD-1553",1000000,"MIL-STD-1553",1000000,"MIL-STD-1553",1000000,"MIL-STD-1553",1000000,"MIL-STD-1553",1000000,"MIL-STD-1553",1000000,"MIL-STD-1553",1000000,"MIL-STD-1553",1000000,"MIL-STD-1553",1000000,"MIL-STD-1553",1000000,"MIL-STD-1553",1000000,"MIL-STD-1553",1000000,"MIL-STD-1553",1000000,"MIL-STD-1553",1000000,"MIL-STD-1553",1000000,"MIL-STD-1553",1000000,"MIL-STD-1553",1000000,"MIL-STD-1553",1000000,"MIL-STD-1553",1000000,"MIL-STD-1553",1000000,"MIL-STD-1553",1000000,"MIL-STD-1553",1000000,"MIL-STD-1553",1000000,"MIL-STD-1553",1000000,"MIL-STD-1553",1000000,"MIL-STD-1553",1000000,"MIL-STD-1553",1000000,"MIL-STD-1553",1000000,"MIL-STD-1553",1000000,"MIL-STD-1553",1000000,"MIL-STD-1553",1000000,"MIL-STD-1553",1000000,"MIL-STD-1553",1000000,"MIL-STD-1553",1000000,"MIL-STD-1553",1000000,"MIL-STD-1553",1000000,"MIL-STD-1553",1000000,"MIL-STD-1553",1000000,"MIL-STD-1553",1000000,"MIL-STD-1553",1000000,"MIL-STD-1553",1000000,"MIL-STD-1553",1000000,"MIL-STD-1553",1000000,"MIL-STD-1553",1000000,"MIL-STD-1553",1000000,"MIL-STD-1553",1000000,"MIL-STD-1553",1000000,"MIL-STD-1553",1000000,"MIL-STD-1553",1000000,"MIL-STD-1553",1000000,"MIL-STD-1553",1000000,"MIL-STD-1553",1000000,"MIL-STD-1553",1000000,"MIL-STD-1553",1000000,"MIL-STD-1553",1000000,"MIL-STD-1553",1000000,"MIL-STD-1553",1000000,"MIL-STD-1553",1000000,"MIL-STD-1553",1000000,"MIL-STD-1553",1000000,"MIL-STD-1553",1000000,"MIL-STD-1553",1000000,"MIL-STD-1553",1000000,"MIL-STD-1553",1000000,"MIL-STD-1553",1000000,"MIL-STD-1553",1000000,"MIL-STD-1553",1000000,"MIL-STD-1553",1000000,"MIL-STD-1553",1000000,"MIL-STD-1553",1000000,"MIL-STD-1553",1000000,"MIL-STD-1553",1000000,"MIL-STD-1553",1000000,"MIL-STD-1553",1000000,"MIL-STD-1553",1000000,"MIL-STD-1553",1000000,"MIL-STD-1553",1000000,"MIL-STD-1553",1000000,"MIL-STD-1553",1000000,"MIL-STD-1553",1000000,"MIL-STD-1553",1000000,"MIL-STD-1553",1000000,"MIL-STD-1553",1000000,"MIL-STD-1553",1000000,"MIL-STD-1553",1000000,"MIL-STD-1553",1000000,"MIL-STD-1553",1000000,"MIL-STD-1553",1000000,"MIL-STD-1553",1000000,"MIL-STD-1553",1000000,"MIL-STD-1553",1000000,"MIL-STD-1553",1000000,"MIL-STD-1553",1000000,"MIL-STD-1553",1000000,"MIL-STD-1553",1000000,"MIL-STD-1553",1000000,"MIL-STD-1553",1000000,"MIL-STD-1553",1000000,"MIL-STD-1553",1000000,"MIL-STD-1553",1000000,"MIL-STD-1553",1000000,"MIL-STD-1553",1000000,"MIL-STD-1553",1000000,"MIL-STD-1553",1000000,"MIL-STD-1553",1000000,"MIL-STD-1553",1000000,"MIL-STD-1553",1000000,"MIL-STD-1553",1000000,"MIL-STD-1553",1000000,"MIL-STD-1553",1000000,"MIL-STD-1553",1000000,"MIL-STD-1553",1000000,"MIL-STD-1553",1000000,"MIL-STD-1553",1000000,"MIL-STD-1553",1000000,"MIL-STD-1553",1000000,"MIL-STD-1553",1000000,"MIL-STD-1553",1000000,"MIL-STD-1553",1000000,"MIL-STD-1553",1000000,"MIL-STD-1553",1000000,"MIL-STD-1553",1000000,"MIL-STD-1553",1000000,"MIL-STD-1553",1000000,"MIL-STD-1553",1000000,"MIL-STD-1553",1000000,"MIL-STD-1553",1000000,"MIL-STD-1553",1000000,"MIL-STD-1553",1000000,"MIL-STD-1553",1000000,"MIL-STD-1553",1000000,"MIL-STD-1553",1000000,"MIL-STD-1553",1000000,"MIL-STD-1553",1000000,"MIL-STD-1553",1000000,"MIL-STD-1553",1000000,"MIL-STD-1553",1000000,"MIL-STD-1553",1000000,"MIL-STD-1553",1000000,"MIL-STD-1553",1000000,"MIL-STD-1553",1000000,"MIL-STD-1553",1000000,"MIL-STD-1553",1000000,"MIL-STD-1553",1000000,"MIL-STD-1553",1000000,"MIL-STD-1553",1000000,"MIL-STD-1553",1000000,"MIL-STD-1553",1000000,"MIL-STD-1553",1000000,"MIL-STD-1553",1000000,"MIL-STD-1553",1000000,"MIL-STD-1553",1000000,"MIL-STD-1553",1000000,"MIL-STD-1553",1000000,"MIL-STD-1553",1000000,"MIL-STD-1553",1000000,"MIL-STD-1553",1000000,"MIL-STD-1553",1000000,"MIL-STD-1553",1000000,"MIL-STD-1553",1000000,"MIL-STD-1553",1000000,"MIL-STD-1553",1000000,"MIL-STD-1553",1000000,"MIL-STD-1553",1000000,"MIL-STD-1553",1000000,"MIL-STD-1553",1000000,"MIL-STD-1553",1000000,"MIL-STD-1553",1000000,"MIL-STD-1553",1000000,"MIL-STD-1553",1000000,"MIL-STD-1553",1000000,"MIL-STD-1553",1000000,"MIL-STD-1553",1000000,"MIL-STD-1553",1000000,"MIL-STD-1553",1000000,"MIL-STD-1553",1000000,"MIL-STD-1553",1000000,"MIL-STD-1553",1000000,"MIL-STD-1553",1000000,"MIL-STD-1553",1000000,"MIL-STD-1553",1000000,"MIL-STD-1553",1000000,"MIL-STD-1553",1000000,"MIL-STD-1553",1000000,"MIL-STD-1553",1000000,"MIL-STD-1553",1000000,"MIL-STD-1553",1000000,"MIL-STD-1553",1000000,"MIL-STD-1553",1000000,"MIL-STD-1553",1000000,"MIL-STD-1553",1000000,"MIL-STD-1553",1000000,"MIL-STD-1553",1000000,"MIL-STD-1553",1000000,"MIL-STD-1553",1000000,"MIL-STD-1553",1000000,"MIL-STD-1553",1000000,"MIL-STD-1553",1000000,"MIL-STD-1553",1000000,"MIL-STD-1553",1000000,"MIL-STD-1553",1000000,"MIL-STD-1553",1000000,"MIL-STD-1553",1000000,"MIL-STD-1553",1000000,"MIL-STD-1553",1000000,"MIL-STD-1553",1000000,"MIL-STD-1553",1000000,"MIL-STD-1553",1000000,"MIL-STD-1553",1000000,"MIL-STD-1553",1000000,"MIL-STD-1553",1000000,"MIL-STD-1553",1000000,"MIL-STD-1553",1000000,"MIL-STD-1553",1000000,"MIL-STD-1553",1000000,"MIL-STD-1553",1000000,"MIL-STD-1553",1000000,"MIL-STD-1553",1000000,"MIL-STD-1553",1000000,"MIL-STD-1553",1000000,"MIL-STD-1553",1000000,"MIL-STD-1553",1000000,"MIL-STD-1553",1000000,"MIL-STD-1553",1000000,"MIL-STD-1553",1000000,"MIL-STD-1553",1000000,"MIL-STD-1553",1000000,"MIL-STD-1553",1000000,"MIL-STD-1553",1000000,"MIL-STD-1553",1000000,"MIL-STD-1553",1000000,"MIL-STD-1553",1000000,"MIL-STD-1553",1000000,"MIL-STD-1553",1000000,"MIL-STD-1553",1000000,"MIL-STD-1553",1000000,"MIL-STD-1553",1000000,"MIL-STD-1553",1000000,"MIL-STD-1553",1000000,"MIL-STD-1553",1000000,"MIL-STD-1553",1000000,"MIL-STD-1553",1000000,"MIL-STD-1553",1000000,"MIL-STD-1553",1000000,"MIL-STD-1553",1000000,"MIL-STD-1553",1000000,"MIL-STD-1553",1000000,"MIL-STD-1553",1000000,"MIL-STD-1553",1000000,"MIL-STD-1553",1000000,"MIL-STD-1553",1000000,"MIL-STD-1553",1000000,"MIL-STD-1553",1000000,"MIL-STD-1553",1000000,"MIL-STD-1553",1000000,"MIL-STD-1553",1000000,"MIL-STD-1553",1000000,"MIL-STD-1553",1000000,"MIL-STD-1553",1000000,"MIL-STD-1553",1000000,"MIL-STD-1553",1000000,"MIL-STD-1553",1000000,"MIL-STD-1553",1000000,"MIL-STD-1553",1000000,"MIL-STD-1553",1000000,"MIL-STD-1553",1000000,"MIL-STD-1553",1000000,"MIL-STD-1553",1000000,"MIL-STD-1553",1000000,"MIL-STD-1553",1000000,"MIL-STD-1553",1000000,"MIL-STD-1553",1000000,"MIL-STD-1553",1000000,"MIL-STD-1553",1000000,"MIL-STD-1553",1000000,"MIL-STD-1553",1000000,"MIL-STD-1553",1000000,"MIL-STD-1553",1000000,"MIL-STD-1553",1000000,"MIL-STD-1553",1000000,"MIL-STD-1553",1000000,"MIL-STD-1553",1000000,"MIL-STD-1553",1000000,"MIL-STD-1553",1000000,"MIL-STD-1553",1000000,"MIL-STD-1553",1000000,"MIL-STD-1553",1000000,"MIL-STD-1553",1000000,"MIL-STD-1553",1000000,"MIL-STD-1553",1000000,"MIL-STD-1553",1000000,"MIL-STD-1553",1000000,"MIL-STD-1553",1000000,"MIL-STD-1553",1000000,"MIL-STD-1553",1000000,"MIL-STD-1553",1000000,"MIL-STD-1553",1000000,"MIL-STD-1553",1000000,"MIL-STD-1553",1000000,"MIL-STD-1553",1000000,"MIL-STD-1553",1000000,"MIL-STD-1553",1000000,"MIL-STD-1553",1000000,"MIL-STD-1553",1000000,"MIL-STD-1553",1000000,"MIL-STD-1553",1000000,"MIL-STD-1553",1000000,"MIL-STD-1553",1000000,"MIL-STD-1553",1000000,"MIL-STD-1553",1000000,"MIL-STD-1553",1000000,"MIL-STD-1553",1000000,"MIL-STD-1553",1000000,"MIL-STD-1553",1000000,"MIL-STD-1553",1000000,"MIL-STD-1553",1000000,"MIL-STD-1553",1000000,"MIL-STD-1553",1000000,"MIL-STD-1553",1000000,"MIL-STD-1553",1000000,"MIL-STD-1553",1000000,"MIL-STD-1553",1000000,"MIL-STD-1553",1000000,"MIL-STD-1553",1000000,"MIL-STD-1553",1000000,"MIL-STD-1553",1000000,"MIL-STD-1553",1000000,"MIL-STD-1553",1000000,"MIL-STD-1553",1000000,"MIL-STD-1553",1000000,"MIL-STD-1553",1000000,"MIL-STD-1553",1000000,"MIL-STD-1553",1000000,"MIL-STD-1553",1000000,"MIL-STD-1553",1000000,"MIL-STD-1553",1000000,"MIL-STD-1553",1000000,"MIL-STD-1553",1000000,"MIL-STD-1553",1000000,"MIL-STD-1553",1000000,"MIL-STD-1553",1000000,"MIL-STD-1553",1000000,"MIL-STD-1553",1000000,"MIL-STD-1553",1000000,"MIL-STD-1553",1000000,"MIL-STD-1553",1000000,"MIL-STD-1553",1000000,"MIL-STD-1553",1000000,"MIL-STD-1553",1000000,"MIL-STD-1553",1000000,"MIL-STD-1553",1000000,"MIL-STD-1553",1000000,"MIL-STD-1553",1000000,"MIL-STD-1553",1000000,"MIL-STD-1553",1000000,"MIL-STD-1553",1000000,"MIL-STD-1553",1000000,"MIL-STD-1553",1000000,"MIL-STD-1553",1000000,"MIL-STD-1553",1000000,"MIL-STD-1553",1000000,"MIL-STD-1553",1000000,"MIL-STD-1553",1000000,"MIL-STD-1553",1000000,"MIL-STD-1553",1000000,"MIL-STD-1553",1000000,"MIL-STD-1553",1000000,"MIL-STD-1553",1000000,"MIL-STD-1553",1000000,"MIL-STD-1553",1000000,"MIL-STD-1553",1000000,"MIL-STD-1553",1000000,"MIL-STD-1553",1000000,"MIL-STD-1553",1000000,"MIL-STD-1553",1000000,"MIL-STD-1553",1000000,"MIL-STD-1553",1000000,"MIL-STD-1553",1000000,"MIL-STD-1553",1000000,"MIL-STD-1553",1000000,"MIL-STD-1553",1000000,"MIL-STD-1553",1000000,"MIL-STD-1553",1000000,"MIL-STD-1553",1000000,"MIL-STD-1553",1000000,"MIL-STD-1553",1000000,"MIL-STD-1553",1000000,"MIL-STD-1553",1000000,"MIL-STD-1553",1000000,"MIL-STD-1553",1000000,"MIL-STD-1553",1000000,"MIL-STD-1553",1000000,"MIL-STD-1553",1000000,"MIL-STD-1553",1000000,"MIL-STD-1553",1000000,"MIL-STD-1553",1000000,"MIL-STD-1553",1000000,"MIL-STD-1553",1000000,"MIL-STD-1553",1000000,"MIL-STD-1553",1000000,"MIL-STD-1553",1000000,"MIL-STD-1553",1000000,"MIL-STD-1553",1000000,"MIL-STD-1553",1000000,"MIL-STD-1553",1000000,"MIL-STD-1553",1000000,"MIL-STD-1553",1000000,"MIL-STD-1553",1000000,"MIL-STD-1553",1000000,"MIL-STD-1553",1000000,"MIL-STD-1553",1000000,"MIL-STD-1553",1000000,"MIL-STD-1553",1000000,"MIL-STD-1553",1000000,"MIL-STD-1553",1000000,"MIL-STD-1553",1000000,"MIL-STD-1553",1000000,"MIL-STD-1553",1000000,"MIL-STD-1553",1000000,"MIL-STD-1553",1000000,"MIL-STD-1553",1000000,"MIL-STD-1553",1000000,"MIL-STD-1553",1000000,"MIL-STD-1553",1000000,"MIL-STD-1553",1000000,"MIL-STD-1553",1000000,"MIL-STD-1553",1000000,"MIL-STD-1553",1000000,"MIL-STD-1553",1000000,"MIL-STD-1553",1000000,"MIL-STD-1553",1000000,"MIL-STD-1553",1000000,"MIL-STD-1553",1000000,"MIL-STD-1553",1000000,"MIL-STD-1553",1000000,"MIL-STD-1553",1000000,"MIL-STD-1553",1000000,"MIL-STD-1553",1000000,"MIL-STD-1553",1000000,"MIL-STD-1553",1000000,"MIL-STD-1553",1000000,"MIL-STD-1553",1000000,"MIL-STD-1553",1000000,"MIL-STD-1553",1000000,"MIL-STD-1553",1000000,"MIL-STD-1553",1000000,"MIL-STD-1553",1000000,"MIL-STD-1553",1000000,"MIL-STD-1553",1000000,"MIL-STD-1553",1000000,"MIL-STD-1553",1000000,"MIL-STD-1553",1000000,"MIL-STD-1553",1000000,"MIL-STD-1553",1000000,"MIL-STD-1553",1000000,"MIL-STD-1553",1000000,"MIL-STD-1553",1000000,"MIL-STD-1553",1000000,"MIL-STD-1553",1000000,"MIL-STD-1553",1000000,"MIL-STD-1553",1000000,"MIL-STD-1553",1000000,"MIL-STD-1553",1000000,"MIL-STD-1553",1000000,"MIL-STD-1553",1000000,"MIL-STD-1553",1000000,"MIL-STD-1553",1000000,"MIL-STD-1553",1000000,"MIL-STD-1553",1000000,"MIL-STD-1553",1000000,"MIL-STD-1553",1000000,"MIL-STD-1553",1000000,"MIL-STD-1553",1000000,"MIL-STD-1553",1000000,"MIL-STD-1553",1000000,"MIL-STD-1553",1000000,"MIL-STD-1553",1000000,"MIL-STD-1553",1000000,"MIL-STD-1553",1000000,"MIL-STD-1553",1000000,"MIL-STD-1553",1000000,"MIL-STD-1553",1000000,"MIL-STD-1553",1000000,"MIL-STD-1553",1000000,"MIL-STD-1553",1000000,"MIL-STD-1553",1000000,"MIL-STD-1553",1000000,"MIL-STD-1553",1000000,"MIL-STD-1553",1000000,"MIL-STD-1553",1000000,"MIL-STD-1553",1000000,"MIL-STD-1553",1000000,"MIL-STD-1553",1000000,"MIL-STD-1553",1000000,"MIL-STD-1553",1000000,"MIL-STD-1553",1000000,"MIL-STD-1553",1000000,"MIL-STD-1553",1000000,"MIL-STD-1553",1000000,"MIL-STD-1553",1000000,"MIL-STD-1553",1000000,"MIL-STD-1553",1000000,"MIL-STD-1553",1000000,"MIL-STD-1553",1000000,"MIL-STD-1553",1000000,"MIL-STD-1553",1000000,"MIL-STD-1553",1000000,"MIL-STD-1553",1000000,"MIL-STD-1553",1000000,"MIL-STD-1553",1000000,"MIL-STD-1553",1000000,"MIL-STD-1553",1000000,"MIL-STD-1553",1000000,"MIL-STD-1553",1000000,"MIL-STD-1553",1000000,"MIL-STD-1553",1000000,"MIL-STD-1553",1000000,"MIL-STD-1553",1000000,"MIL-STD-1553",1000000,"MIL-STD-1553",1000000,"MIL-STD-1553",1000000,"MIL-STD-1553",1000000,"MIL-STD-1553",1000000,"MIL-STD-1553",1000000,"MIL-STD-1553",1000000,"MIL-STD-1553",1000000,"MIL-STD-1553",1000000,"MIL-STD-1553",1000000,"MIL-STD-1553",1000000,"MIL-STD-1553",1000000,"MIL-STD-1553",1000000,"MIL-STD-1553",1000000,"MIL-STD-1553",1000000,"MIL-STD-1553",1000000,"MIL-STD-1553",1000000,"MIL-STD-1553",1000000,"MIL-STD-1553",1000000,"MIL-STD-1553",1000000,"MIL-STD-1553",1000000,"MIL-STD-1553",1000000,"MIL-STD-1553",1000000,"MIL-STD-1553",1000000,"MIL-STD-1553",1000000,"MIL-STD-1553",1000000,"MIL-STD-1553",1000000,"MIL-STD-1553",1000000,"MIL-STD-1553",1000000,"MIL-STD-1553",1000000,"MIL-STD-1553",1000000,"MIL-STD-1553",1000000,"MIL-STD-1553",1000000,"MIL-STD-1553",1000000,"MIL-STD-1553",1000000,"MIL-STD-1553",1000000,"MIL-STD-1553",1000000,"MIL-STD-1553",1000000,"MIL-STD-1553",1000000,"MIL-STD-1553",1000000,"MIL-STD-1553",1000000,"MIL-STD-1553",1000000,"MIL-STD-1553",1000000,"MIL-STD-1553",1000000,"MIL-STD-1553",1000000,"MIL-STD-1553",1000000,"MIL-STD-1553",1000000,"MIL-STD-1553",1000000,"MIL-STD-1553",1000000,"MIL-STD-1553",1000000,"MIL-STD-1553",1000000,"MIL-STD-1553",1000000,"MIL-STD-1553",1000000,"MIL-STD-1553",1000000,"MIL-STD-1553",1000000,"MIL-STD-1553",1000000,"MIL-STD-1553",1000000,"MIL-STD-1553",1000000,"MIL-STD-1553",1000000,"MIL-STD-1553",1000000,"MIL-STD-1553",1000000,"MIL-STD-1553",1000000,"MIL-STD-1553",1000000,"MIL-STD-1553",1000000,"MIL-STD-1553",1000000,"MIL-STD-1553",1000000,"MIL-STD-1553",1000000,"MIL-STD-1553",1000000,"MIL-STD-1553",1000000,"MIL-STD-1553",1000000,"MIL-STD-1553",1000000,"MIL-STD-1553",1000000,"MIL-STD-1553",1000000,"MIL-STD-1553",1000000,"MIL-STD-1553",1000000,"MIL-STD-1553",1000000,"MIL-STD-1553",1000000,"MIL-STD-1553",1000000,"MIL-STD-1553",1000000,"MIL-STD-1553",1000000,"MIL-STD-1553",1000000,"MIL-STD-1553",1000000,"MIL-STD-1553",1000000,"MIL-STD-1553",1000000,"MIL-STD-1553",1000000,"MIL-STD-1553",1000000,"MIL-STD-1553",1000000,"MIL-STD-1553",1000000,"MIL-STD-1553",1000000,"MIL-STD-1553",1000000,"MIL-STD-1553",1000000,"MIL-STD-1553",1000000,"MIL-STD-1553",1000000,"MIL-STD-1553",1000000,"MIL-STD-1553",1000000,"MIL-STD-1553",1000000,"MIL-STD-1553",1000000,"MIL-STD-1553",1000000,"MIL-STD-1553",1000000,"MIL-STD-1553",1000000,"MIL-STD-1553",1000000,"MIL-STD-1553",1000000,"MIL-STD-1553",1000000,"MIL-STD-1553",1000000,"MIL-STD-1553",1000000,"MIL-STD-1553",1000000,"MIL-STD-1553",1000000,"MIL-STD-1553",1000000,"MIL-STD-1553",1000000,"MIL-STD-1553",1000000,"MIL-STD-1553",1000000,"MIL-STD-1553",1000000,"MIL-STD-1553",1000000,"MIL-STD-1553",1000000,"MIL-STD-1553",1000000,"MIL-STD-1553",1000000,"MIL-STD-1553",1000000,"MIL-STD-1553",1000000,"MIL-STD-1553",1000000,"MIL-STD-1553",1000000,"MIL-STD-1553",1000000,"MIL-STD-1553",1000000,"MIL-STD-1553",1000000,"MIL-STD-1553",1000000,"MIL-STD-1553",1000000,"MIL-STD-1553",1000000,"MIL-STD-1553",1000000,"MIL-STD-1553",1000000,"MIL-STD-1553",1000000,"MIL-STD-1553",1000000,"MIL-STD-1553",1000000,"MIL-STD-1553",1000000,"MIL-STD-1553",1000000,"MIL-STD-1553",1000000,"MIL-STD-1553",1000000,"MIL-STD-1553",1000000,"MIL-STD-1553",1000000,"MIL-STD-1553",1000000,"MIL-STD-1553",1000000,"MIL-STD-1553",1000000,"MIL-STD-1553",1000000,"MIL-STD-1553",1000000,"MIL-STD-1553",1000000,"MIL-STD-1553",1000000,"MIL-STD-1553",1000000,"MIL-STD-1553",1000000,"MIL-STD-1553",1000000,"MIL-STD-1553",1000000,"MIL-STD-1553",1000000,"MIL-STD-1553",1000000,"MIL-STD-1553",1000000,"MIL-STD-1553",1000000,"MIL-STD-1553",1000000,"MIL-STD-1553",1000000,"MIL-STD-1553",1000000,"MIL-STD-1553",1000000,"MIL-STD-1553",1000000,"MIL-STD-1553",1000000,"MIL-STD-1553",1000000,"MIL-STD-1553",1000000,"MIL-STD-1553",1000000,"MIL-STD-1553",1000000,"MIL-STD-1553",1000000,"MIL-STD-1553",1000000,"MIL-STD-1553",1000000,"MIL-STD-1553",1000000,"MIL-STD-1553",1000000,"MIL-STD-1553",1000000,"MIL-STD-1553",1000000,"MIL-STD-1553",1000000,"MIL-STD-1553",1000000,"MIL-STD-1553",1000000,"MIL-STD-1553",1000000,"MIL-STD-1553",1000000,"MIL-STD-1553",1000000,"MIL-STD-1553",1000000,"MIL-STD-1553",1000000,"MIL-STD-1553",1000000,"MIL-STD-1553",1000000,"MIL-STD-1553",1000000,"MIL-STD-1553",1000000,"MIL-STD-1553",1000000,"MIL-STD-1553",1000000,"MIL-STD-1553",1000000,"MIL-STD-1553",1000000,"MIL-STD-1553",1000000,"MIL-STD-1553",1000000,"MIL-STD-1553",1000000,"MIL-STD-1553",1000000,"MIL-STD-1553",1000000,"MIL-STD-1553",1000000,"MIL-STD-1553",1000000,"MIL-STD-1553",1000000,"MIL-STD-1553",1000000,"MIL-STD-1553",1000000,"MIL-STD-1553",1000000,"MIL-STD-1553",1000000,"MIL-STD-1553",1000000,"MIL-STD-1553",1000000,"MIL-STD-1553",1000000,"MIL-STD-1553",1000000,"MIL-STD-1553",1000000,"MIL-STD-1553",1000000,"MIL-STD-1553",1000000,"MIL-STD-1553",1000000,"MIL-STD-1553",1000000,"MIL-STD-1553",1000000,"MIL-STD-1553",1000000,"MIL-STD-1553",1000000,"MIL-STD-1553",1000000,"MIL-STD-1553",1000000,"MIL-STD-1553",1000000,"MIL-STD-1553",1000000,"MIL-STD-1553",1000000,"MIL-STD-1553",1000000,"MIL-STD-1553",1000000,"MIL-STD-1553",1000000,"MIL-STD-1553",1000000,"MIL-STD-1553",1000000,"MIL-STD-1553",1000000,"MIL-STD-1553",1000000,"MIL-STD-1553",1000000,"MIL-STD-1553",1000000,"MIL-STD-1553",1000000,"MIL-STD-1553",1000000,"MIL-STD-1553",1000000,"MIL-STD-1553",1000000,"MIL-STD-1553",1000000,"MIL-STD-1553",1000000,"MIL-STD-1553",1000000,"MIL-STD-1553",1000000,"MIL-STD-1553",1000000,"MIL-STD-1553",1000000,"MIL-STD-1553",1000000,"MIL-STD-1553",1000000,"MIL-STD-1553",1000000,"MIL-STD-1553",1000000,"MIL-STD-1553",1000000,"MIL-STD-1553",1000000,"MIL-STD-1553",1000000,"MIL-STD-1553",1000000,"MIL-STD-1553",1000000,"MIL-STD-1553",1000000,"MIL-STD-1553",1000000,"MIL-STD-1553",1000000,"MIL-STD-1553",1000000,"MIL-STD-1553",1000000,"MIL-STD-1553",1000000,"MIL-STD-1553",1000000,"MIL-STD-1553",1000000,"MIL-STD-1553",1000000,"MIL-STD-1553",1000000,"MIL-STD-1553",1000000,"MIL-STD-1553",1000000,"MIL-STD-1553",1000000,"MIL-STD-1553",1000000,"MIL-STD-1553",1000000,"MIL-STD-1553",1000000,"MIL-STD-1553",1000000,"MIL-STD-1553",1000000,"MIL-STD-1553",1000000,"MIL-STD-1553",1000000,"MIL-STD-1553",1000000,"MIL-STD-1553",1000000,"MIL-STD-1553",1000000,"MIL-STD-1553",1000000,"MIL-STD-1553",1000000,"MIL-STD-1553",1000000,"MIL-STD-1553",1000000,"MIL-STD-1553",1000000,"MIL-STD-1553",1000000,"MIL-STD-1553",1000000,"MIL-STD-1553",1000000,"MIL-STD-1553",1000000,"MIL-STD-1553",1000000,"MIL-STD-1553",1000000,"MIL-STD-1553",1000000,"MIL-STD-1553",1000000,"MIL-STD-1553",1000000,"MIL-STD-1553",1000000,"MIL-STD-1553",1000000,"MIL-STD-1553",1000000,"MIL-STD-1553",1000000,"MIL-STD-1553",1000000,"MIL-STD-1553",1000000,"MIL-STD-1553",1000000,"MIL-STD-1553",1000000,"MIL-STD-1553",1000000,"MIL-STD-1553",1000000,"MIL-STD-1553",1000000,"MIL-STD-1553",1000000,"MIL-STD-1553",1000000,"MIL-STD-1553",1000000,"MIL-STD-1553",1000000,"MIL-STD-1553",1000000,"MIL-STD-1553",1000000,"MIL-STD-1553",1000000,"MIL-STD-1553",1000000,"MIL-STD-1553",1000000,"MIL-STD-1553",1000000,"MIL-STD-1553",1000000,"MIL-STD-1553",1000000,"MIL-STD-1553",1000000,"MIL-STD-1553",1000000,"MIL-STD-1553",1000000,"MIL-STD-1553",1000000,"MIL-STD-1553",1000000,"MIL-STD-1553",1000000,"MIL-STD-1553",1000000,"MIL-STD-1553",1000000,"MIL-STD-1553",1000000,"MIL-STD-1553",1000000,"MIL-STD-1553",1000000,"MIL-STD-1553",1000000,"MIL-STD-1553",1000000,"MIL-STD-1553",1000000,"MIL-STD-1553",1000000,"MIL-STD-1553",1000000,"MIL-STD-1553",1000000,"MIL-STD-1553",1000000,"MIL-STD-1553",1000000,"MIL-STD-1553",1000000,"MIL-STD-1553",1000000,"MIL-STD-1553",1000000,"MIL-STD-1553",1000000,"MIL-STD-1553",1000000,"MIL-STD-1553",1000000,"MIL-STD-1553",1000000,"MIL-STD-1553",1000000,"MIL-STD-1553",1000000,"MIL-STD-1553",1000000,"MIL-STD-1553",1000000,"MIL-STD-1553",1000000,"MIL-STD-1553",1000000,"MIL-STD-1553",1000000,"MIL-STD-1553",1000000,"MIL-STD-1553",1000000,"MIL-STD-1553",1000000,"MIL-STD-1553",1000000,"MIL-STD-1553",1000000,"MIL-STD-1553",1000000,"MIL-STD-1553",1000000,"MIL-STD-1553",1000000,"MIL-STD-1553",1000000,"MIL-STD-1553",1000000,"MIL-STD-1553",1000000,"MIL-STD-1553",1000000,"MIL-STD-1553",1000000,"MIL-STD-1553",1000000,"MIL-STD-1553",1000000,"MIL-STD-1553",1000000,"MIL-STD-1553",1000000,"MIL-STD-1553",1000000,"MIL-STD-1553",1000000,"MIL-STD-1553",1000000,"MIL-STD-1553",1000000,"MIL-STD-1553",1000000,"MIL-STD-1553",1000000,"MIL-STD-1553",1000000,"MIL-STD-1553",1000000,"MIL-STD-1553",1000000,"MIL-STD-1553",1000000,"MIL-STD-1553",1000000,"MIL-STD-1553",1000000,"MIL-STD-1553",1000000,"MIL-STD-1553",1000000,"MIL-STD-1553",1000000,"MIL-STD-1553",1000000,"MIL-STD-1553",1000000,"MIL-STD-1553",1000000,"MIL-STD-1553",1000000,"MIL-STD-1553",1000000,"MIL-STD-1553",1000000,"MIL-STD-1553",1000000,"MIL-STD-1553",1000000,"MIL-STD-1553",1000000,"MIL-STD-1553",1000000,"MIL-STD-1553",1000000,"MIL-STD-1553",1000000,"MIL-STD-1553",1000000,"MIL-STD-1553",1000000,"MIL-STD-1553",1000000,"MIL-STD-1553",1000000,"MIL-STD-1553",1000000,"MIL-STD-1553",1000000,"MIL-STD-1553",1000000,"MIL-STD-1553",1000000,"MIL-STD-1553",1000000,"MIL-STD-1553",1000000,"MIL-STD-1553",1000000,"MIL-STD-1553",1000000,"MIL-STD-1553",1000000,"MIL-STD-1553",1000000,"MIL-STD-1553",1000000,"MIL-STD-1553",1000000,"MIL-STD-1553",1000000,"MIL-STD-1553",1000000,"MIL-STD-1553",1000000,"MIL-STD-1553",1000000,"MIL-STD-1553",1000000,"MIL-STD-1553",1000000,"MIL-STD-1553",1000000,"MIL-STD-1553",1000000,"MIL-STD-1553",1000000,"MIL-STD-1553",1000000,"MIL-STD-1553",1000000,"MIL-STD-1553",1000000,"MIL-STD-1553",1000000,"MIL-STD-1553",1000000,"MIL-STD-1553",1000000,"MIL-STD-1553",1000000,"MIL-STD-1553",1000000,"MIL-STD-1553",1000000,"MIL-STD-1553",1000000,"MIL-STD-1553",1000000,"MIL-STD-1553",1000000,"MIL-STD-1553",1000000,"MIL-STD-1553",1000000,"MIL-STD-1553",1000000,"MIL-STD-1553",1000000,"MIL-STD-1553",1000000,"MIL-STD-1553",1000000,"MIL-STD-1553",1000000,"MIL-STD-1553",1000000,"MIL-STD-1553",1000000,"MIL-STD-1553",1000000,"MIL-STD-1553",1000000,"MIL-STD-1553",1000000,"MIL-STD-1553",1000000,"MIL-STD-1553",1000000,"MIL-STD-1553",1000000,"MIL-STD-1553",1000000,"MIL-STD-1553",1000000,"MIL-STD-1553",1000000,"MIL-STD-1553",1000000,"MIL-STD-1553",1000000,"MIL-STD-1553",1000000,"MIL-STD-1553",1000000,"MIL-STD-1553",1000000,"MIL-STD-1553",1000000,"MIL-STD-1553",1000000,"MIL-STD-1553",1000000,"MIL-STD-1553",1000000,"MIL-STD-1553",1000000,"MIL-STD-1553",1000000,"MIL-STD-1553",1000000,"MIL-STD-1553",1000000,"MIL-STD-1553",1000000,"MIL-STD-1553",1000000,"MIL-STD-1553",1000000,"MIL-STD-1553",1000000,"MIL-STD-1553",1000000,"MIL-STD-1553",1000000,"MIL-STD-1553",1000000,"MIL-STD-1553",1000000,"MIL-STD-1553",1000000,"MIL-STD-1553",1000000,"MIL-STD-1553",1000000,"MIL-STD-1553",1000000,"MIL-STD-1553",1000000,"MIL-STD-1553",1000000,"MIL-STD-1553",1000000,"MIL-STD-1553",1000000,"MIL-STD-1553",1000000,"MIL-STD-1553",1000000,"MIL-STD-1553",1000000,"MIL-STD-1553",1000000,"MIL-STD-1553",1000000,"MIL-STD-1553",1000000,"MIL-STD-1553",1000000,"MIL-STD-1553",1000000,"MIL-STD-1553",1000000,"MIL-STD-1553",1000000,"MIL-STD-1553",1000000,"MIL-STD-1553",1000000,"MIL-STD-1553",1000000,"MIL-STD-1553",1000000,"MIL-STD-1553",1000000,"MIL-STD-1553",1000000,"MIL-STD-1553",1000000,"MIL-STD-1553",1000000,"MIL-STD-1553",1000000,"MIL-STD-1553",1000000,"MIL-STD-1553",1000000,"MIL-STD-1553",1000000,"MIL-STD-1553",1000000,"MIL-STD-1553",1000000,"MIL-STD-1553",1000000,"MIL-STD-1553",1000000,"MIL-STD-1553",1000000,"MIL-STD-1553",1000000,"MIL-STD-1553",1000000,"MIL-STD-1553",1000000,"MIL-STD-1553",1000000,"MIL-STD-1553",1000000,"MIL-STD-1553",1000000,"MIL-STD-1553",1000000,"MIL-STD-1553",1000000,"MIL-STD-1553",1000000,"MIL-STD-1553",1000000,"MIL-STD-1553",1000000,"MIL-STD-1553",1000000,"MIL-STD-1553",1000000,"MIL-STD-1553",1000000,"MIL-STD-1553",1000000,"MIL-STD-1553",1000000,"MIL-STD-1553",1000000,"MIL-STD-1553",1000000,"MIL-STD-1553",1000000,"MIL-STD-1553",1000000,"MIL-STD-1553",1000000,"MIL-STD-1553",1000000,"MIL-STD-1553",1000000,"MIL-STD-1553",1000000,"MIL-STD-1553",1000000,"MIL-STD-1553",1000000,"MIL-STD-1553",1000000,"MIL-STD-1553",1000000,"MIL-STD-1553",1000000,"MIL-STD-1553",1000000,"MIL-STD-1553",1000000,"MIL-STD-1553",1000000,"MIL-STD-1553",1000000,"MIL-STD-1553",1000000,"MIL-STD-1553",1000000,"MIL-STD-1553",1000000,"MIL-STD-1553",1000000,"MIL-STD-1553",1000000,"MIL-STD-1553",1000000,"MIL-STD-1553",1000000,"MIL-STD-1553",1000000,"MIL-STD-1553",1000000,"MIL-STD-1553",1000000,"MIL-STD-1553",1000000,"MIL-STD-1553",1000000,"MIL-STD-1553",1000000,"MIL-STD-1553",1000000,"MIL-STD-1553",1000000,"MIL-STD-1553",1000000,"MIL-STD-1553",1000000,"MIL-STD-1553",1000000,"MIL-STD-1553",1000000,"MIL-STD-1553",1000000,"MIL-STD-1553",1000000,"MIL-STD-1553",1000000,"MIL-STD-1553",1000000,"MIL-STD-1553",1000000,"MIL-STD-1553",1000000,"MIL-STD-1553",1000000,"MIL-STD-1553",1000000,"MIL-STD-1553",1000000,"MIL-STD-1553",1000000,"MIL-STD-1553",1000000,"MIL-STD-1553",1000000,"MIL-STD-1553",1000000,"MIL-STD-1553",1000000,"MIL-STD-1553",1000000,"MIL-STD-1553",1000000,"MIL-STD-1553",1000000,"MIL-STD-1553",1000000,"MIL-STD-1553",1000000,"MIL-STD-1553",1000000,"MIL-STD-1553",1000000,"MIL-STD-1553",1000000,"MIL-STD-1553",1000000,"MIL-STD-1553",1000000,"MIL-STD-1553",1000000,"MIL-STD-1553",1000000,"MIL-STD-1553",1000000,"MIL-STD-1553",1000000,"MIL-STD-1553",1000000,"MIL-STD-1553",1000000,"MIL-STD-1553",1000000,"MIL-STD-1553",1000000,"MIL-STD-1553",1000000,"MIL-STD-1553",1000000,"MIL-STD-1553",1000000,"MIL-STD-1553",1000000,"MIL-STD-1553",1000000,"MIL-STD-1553",1000000,"MIL-STD-1553",1000000,"MIL-STD-1553",1000000,"MIL-STD-1553",1000000,"MIL-STD-1553",1000000,"MIL-STD-1553",1000000,"MIL-STD-1553",1000000,"MIL-STD-1553",1000000,"MIL-STD-1553",1000000,"MIL-STD-1553",1000000,"MIL-STD-1553",1000000,"MIL-STD-1553",1000000,"MIL-STD-1553",1000000,"MIL-STD-1553",1000000,"MIL-STD-1553",1000000,"MIL-STD-1553",1000000,"MIL-STD-1553",1000000,"MIL-STD-1553",1000000,"MIL-STD-1553",1000000,"MIL-STD-1553",1000000,"MIL-STD-1553",1000000,"MIL-STD-1553",1000000,"MIL-STD-1553",1000000,"MIL-STD-1553",1000000,"MIL-STD-1553",1000000,"MIL-STD-1553",1000000,"MIL-STD-1553",1000000,"MIL-STD-1553",1000000,"MIL-STD-1553",1000000,"MIL-STD-1553",1000000,"MIL-STD-1553",1000000,"MIL-STD-1553",1000000,"MIL-STD-1553",1000000,"MIL-STD-1553",1000000,"MIL-STD-1553",1000000,"MIL-STD-1553",1000000,"MIL-STD-1553",1000000,"MIL-STD-1553",1000000,"MIL-STD-1553",1000000,"MIL-STD-1553",1000000,"MIL-STD-1553",1000000,"MIL-STD-1553",1000000,"MIL-STD-1553",1000000,"MIL-STD-1553",1000000,"MIL-STD-1553",1000000,"MIL-STD-1553",1000000,"MIL-STD-1553",1000000,"MIL-STD-1553",1000000,"MIL-STD-1553",1000000,"MIL-STD-1553",1000000,"MIL-STD-1553",1000000,"MIL-STD-1553",1000000,"MIL-STD-1553",1000000,"MIL-STD-1553",1000000,"MIL-STD-1553",1000000,"MIL-STD-1553",1000000,"MIL-STD-1553",1000000,"MIL-STD-1553",1000000,"MIL-STD-1553",1000000,"MIL-STD-1553",1000000,"MIL-STD-1553",1000000,"MIL-STD-1553",1000000,"MIL-STD-1553",1000000,"MIL-STD-1553",1000000,"MIL-STD-1553",1000000,"MIL-STD-1553",1000000,"MIL-STD-1553",1000000,"MIL-STD-1553",1000000,"MIL-STD-1553",1000000,"MIL-STD-1553",1000000,"MIL-STD-1553",1000000,"MIL-STD-1553",1000000,"MIL-STD-1553",1000000,"MIL-STD-1553",1000000,"MIL-STD-1553",1000000,"MIL-STD-1553",1000000,"MIL-STD-1553",1000000,"MIL-STD-1553",1000000,"MIL-STD-1553",1000000,"MIL-STD-1553",1000000,"MIL-STD-1553",1000000,"MIL-STD-1553",1000000,"MIL-STD-1553",1000000,"MIL-STD-1553",1000000,"MIL-STD-1553",1000000,"MIL-STD-1553",1000000,"MIL-STD-1553",1000000,"MIL-STD-1553",1000000,"MIL-STD-1553",1000000,"MIL-STD-1553",1000000,"MIL-STD-1553",1000000,"MIL-STD-1553",1000000,"MIL-STD-1553",1000000,"MIL-STD-1553",1000000,"MIL-STD-1553",1000000,"MIL-STD-1553",1000000,"MIL-STD-1553",1000000,"MIL-STD-1553",1000000,"MIL-STD-1553",1000000,"MIL-STD-1553",1000000,"MIL-STD-1553",1000000,"MIL-STD-1553",1000000,"MIL-STD-1553",1000000,"MIL-STD-1553",1000000,"MIL-STD-1553",1000000,"MIL-STD-1553",1000000,"MIL-STD-1553",1000000,"MIL-STD-1553",1000000,"MIL-STD-1553",1000000,"MIL-STD-1553",1000000,"MIL-STD-1553",1000000,"MIL-STD-1553",1000000,"MIL-STD-1553",1000000,"MIL-STD-1553",1000000,"MIL-STD-1553",1000000,"MIL-STD-1553",1000000,"MIL-STD-1553",1000000,"MIL-STD-1553",1000000,"MIL-STD-1553",1000000,"MIL-STD-1553",1000000,"MIL-STD-1553",1000000,"MIL-STD-1553",1000000,"MIL-STD-1553",1000000,"MIL-STD-1553",1000000,"MIL-STD-1553",1000000,"MIL-STD-1553",1000000,"MIL-STD-1553",1000000,"MIL-STD-1553",1000000,"MIL-STD-1553",1000000,"MIL-STD-1553",1000000,"MIL-STD-1553",1000000,"MIL-STD-1553",1000000,"MIL-STD-1553",1000000,"MIL-STD-1553",1000000,"MIL-STD-1553",1000000,"MIL-STD-1553",1000000,"MIL-STD-1553",1000000,"MIL-STD-1553",1000000,"MIL-STD-1553",1000000,"MIL-STD-1553",1000000,"MIL-STD-1553",1000000,"MIL-STD-1553",1000000,"MIL-STD-1553",1000000,"MIL-STD-1553",1000000,"MIL-STD-1553",1000000,"MIL-STD-1553",1000000,"MIL-STD-1553",1000000,"MIL-STD-1553",1000000,"MIL-STD-1553",1000000,"MIL-STD-1553",1000000,"MIL-STD-1553",1000000,"MIL-STD-1553",1000000,"MIL-STD-1553",1000000,"MIL-STD-1553",1000000,"MIL-STD-1553",1000000,"MIL-STD-1553",1000000,"MIL-STD-1553",1000000,"MIL-STD-1553",1000000,"MIL-STD-1553",1000000,"MIL-STD-1553",1000000,"MIL-STD-1553",1000000,"MIL-STD-1553",1000000,"MIL-STD-1553",1000000,"MIL-STD-1553",1000000,"MIL-STD-1553",1000000,"MIL-STD-1553",1000000,"MIL-STD-1553",1000000,"MIL-STD-1553",1000000,"MIL-STD-1553",1000000,"MIL-STD-1553",1000000,"MIL-STD-1553",1000000,"MIL-STD-1553",1000000,"MIL-STD-1553",1000000,"MIL-STD-1553",1000000,"MIL-STD-1553",1000000,"MIL-STD-1553",1000000,"MIL-STD-1553",1000000,"MIL-STD-1553",1000000,"MIL-STD-1553",1000000,"MIL-STD-1553",1000000,"MIL-STD-1553",1000000,"MIL-STD-1553",1000000,"MIL-STD-1553",1000000,"MIL-STD-1553",1000000,"MIL-STD-1553",1000000,"MIL-STD-1553",1000000,"MIL-STD-1553",1000000,"MIL-STD-1553",1000000,"MIL-STD-1553",1000000,"MIL-STD-1553",1000000,"MIL-STD-1553",1000000,"MIL-STD-1553",1000000,"MIL-STD-1553",1000000,"MIL-STD-1553",1000000,"MIL-STD-1553",1000000,"MIL-STD-1553",1000000,"MIL-STD-1553",1000000,"MIL-STD-1553",1000000,"MIL-STD-1553",1000000,"MIL-STD-1553",1000000,"MIL-STD-1553",1000000,"MIL-STD-1553",1000000,"MIL-STD-1553",1000000,"MIL-STD-1553",1000000,"MIL-STD-1553",1000000,"MIL-STD-1553",1000000,"MIL-STD-1553",1000000,"MIL-STD-1553",1000000,"MIL-STD-1553",1000000,"MIL-STD-1553",1000000,"MIL-STD-1553",1000000,"MIL-STD-1553",1000000,"MIL-STD-1553",1000000,"MIL-STD-1553",1000000,"MIL-STD-1553",1000000,"MIL-STD-1553",1000000,"MIL-STD-1553",1000000,"MIL-STD-1553",1000000,"MIL-STD-1553",1000000,"MIL-STD-1553",1000000,"MIL-STD-1553",1000000,"MIL-STD-1553",1000000,"MIL-STD-1553",1000000,"MIL-STD-1553",1000000,"MIL-STD-1553",1000000,"MIL-STD-1553",1000000,"MIL-STD-1553",1000000,"MIL-STD-1553",1000000,"MIL-STD-1553",1000000,"MIL-STD-1553",1000000,"MIL-STD-1553",1000000,"MIL-STD-1553",1000000,"MIL-STD-1553",1000000,"MIL-STD-1553",1000000,"MIL-STD-1553",1000000,"MIL-STD-1553",1000000,"MIL-STD-1553",1000000,"MIL-STD-1553",1000000,"MIL-STD-1553",1000000,"MIL-STD-1553",1000000,"MIL-STD-1553",1000000,"MIL-STD-1553",1000000,"MIL-STD-1553",1000000,"MIL-STD-1553",1000000,"MIL-STD-1553",1000000,"MIL-STD-1553",1000000,"MIL-STD-1553",1000000,"MIL-STD-1553",1000000,"MIL-STD-1553",1000000,"MIL-STD-1553",1000000,"MIL-STD-1553",1000000,"MIL-STD-1553",1000000,"MIL-STD-1553",1000000,"MIL-STD-1553",1000000,"MIL-STD-1553",1000000,"MIL-STD-1553",1000000,"MIL-STD-1553",1000000,"MIL-STD-1553",1000000,"MIL-STD-1553",1000000,"MIL-STD-1553",1000000,"MIL-STD-1553",1000000,"MIL-STD-1553",1000000,"MIL-STD-1553",1000000,"MIL-STD-1553",1000000,"MIL-STD-1553",1000000,"MIL-STD-1553",1000000,"MIL-STD-1553",1000000,"MIL-STD-1553",1000000,"MIL-STD-1553",1000000,"MIL-STD-1553",1000000,"MIL-STD-1553",1000000,"MIL-STD-1553",1000000,"MIL-STD-1553",1000000,"MIL-STD-1553",1000000,"MIL-STD-1553",1000000,"MIL-STD-1553",1000000,"MIL-STD-1553",1000000,"MIL-STD-1553",1000000,"MIL-STD-1553",1000000,"MIL-STD-1553",1000000,"MIL-STD-1553",1000000,"MIL-STD-1553",1000000,"MIL-STD-1553",1000000,"MIL-STD-1553",1000000,"MIL-STD-1553",1000000,"MIL-STD-1553",1000000,"MIL-STD-1553",1000000,"MIL-STD-1553",1000000,"MIL-STD-1553",1000000,"MIL-STD-1553",1000000,"MIL-STD-1553",1000000,"MIL-STD-1553",1000000,"MIL-STD-1553",1000000,"MIL-STD-1553",1000000,"MIL-STD-1553",1000000,"MIL-STD-1553",1000000,"MIL-STD-1553",1000000,"MIL-STD-1553",1000000,"MIL-STD-1553",1000000,"MIL-STD-1553",1000000,"MIL-STD-1553",1000000,"MIL-STD-1553",1000000,"MIL-STD-1553",1000000,"MIL-STD-1553",1000000,"MIL-STD-1553",1000000,"MIL-STD-1553",1000000,"MIL-STD-1553",1000000,"MIL-STD-1553",1000000,"MIL-STD-1553",1000000,"MIL-STD-1553",1000000,"MIL-STD-1553",1000000,"MIL-STD-1553",1000000,"MIL-STD-1553",1000000,"MIL-STD-1553",1000000,"MIL-STD-1553",1000000,"MIL-STD-1553",1000000,"MIL-STD-1553",1000000,"MIL-STD-1553",1000000,"MIL-STD-1553",1000000,"MIL-STD-1553",1000000,"MIL-STD-1553",1000000,"MIL-STD-1553",1000000,"MIL-STD-1553",1000000,"MIL-STD-1553",1000000,"MIL-STD-1553",1000000,"MIL-STD-1553",1000000,"MIL-STD-1553",1000000,"MIL-STD-1553",1000000,"MIL-STD-1553",1000000,"MIL-STD-1553",1000000,"MIL-STD-1553",1000000,"MIL-STD-1553",1000000,"MIL-STD-1553",1000000,"MIL-STD-1553",1000000,"MIL-STD-1553",1000000,"MIL-STD-1553",1000000,"MIL-STD-1553",1000000,"MIL-STD-1553",1000000,"MIL-STD-1553",1000000,"MIL-STD-1553",1000000,"MIL-STD-1553",1000000,"MIL-STD-1553",1000000,"MIL-STD-1553",1000000,"MIL-STD-1553",1000000,"MIL-STD-1553",1000000,"MIL-STD-1553",1000000,"MIL-STD-1553",1000000,"MIL-STD-1553",1000000,"MIL-STD-1553",1000000,"MIL-STD-1553",1000000,"MIL-STD-1553",1000000,"MIL-STD-1553",1000000,"MIL-STD-1553",1000000,"MIL-STD-1553",1000000,"MIL-STD-1553",1000000,"MIL-STD-1553",1000000,"MIL-STD-1553",1000000,"MIL-STD-1553",1000000,"MIL-STD-1553",1000000,"MIL-STD-1553",1000000,"MIL-STD-1553",1000000,"MIL-STD-1553",1000000,"MIL-STD-1553",1000000,"MIL-STD-1553",1000000,"MIL-STD-1553",1000000,"MIL-STD-1553",1000000,"MIL-STD-1553",1000000,"MIL-STD-1553",1000000,"MIL-STD-1553",1000000,"MIL-STD-1553",1000000,"MIL-STD-1553",1000000,"MIL-STD-1553",1000000,"MIL-STD-1553",1000000,"MIL-STD-1553",1000000,"MIL-STD-1553",1000000,"MIL-STD-1553",1000000,"MIL-STD-1553",1000000,"MIL-STD-1553",1000000,"MIL-STD-1553",1000000,"MIL-STD-1553",1000000,"MIL-STD-1553",1000000,"MIL-STD-1553",1000000,"MIL-STD-1553",1000000,"MIL-STD-1553",1000000,"MIL-STD-1553",1000000,"MIL-STD-1553",1000000,"MIL-STD-1553",1000000,"MIL-STD-1553",1000000,"MIL-STD-1553",1000000,"MIL-STD-1553",1000000,"MIL-STD-1553",1000000,"MIL-STD-1553",1000000,"MIL-STD-1553",1000000,"MIL-STD-1553",1000000,"MIL-STD-1553",1000000,"MIL-STD-1553",1000000,"MIL-STD-1553",1000000,"MIL-STD-1553",1000000,"MIL-STD-1553",1000000,"MIL-STD-1553",1000000,"MIL-STD-1553",1000000,"MIL-STD-1553",1000000,"MIL-STD-1553",1000000,"MIL-STD-1553",1000000,"MIL-STD-1553",1000000,"MIL-STD-1553",1000000,"MIL-STD-1553",1000000,"MIL-STD-1553",1000000,"MIL-STD-1553",1000000,"MIL-STD-1553",1000000,"MIL-STD-1553",1000000,"MIL-STD-1553",1000000,"MIL-STD-1553",1000000,"MIL-STD-1553",1000000,"MIL-STD-1553",1000000,"MIL-STD-1553",1000000,"MIL-STD-1553",1000000,"MIL-STD-1553",1000000,"MIL-STD-1553",1000000,"MIL-STD-1553",1000000,"MIL-STD-1553",1000000,"MIL-STD-1553",1000000,"MIL-STD-1553",1000000,"MIL-STD-1553",1000000,"MIL-STD-1553",1000000,"MIL-STD-1553",1000000,"MIL-STD-1553",1000000,"MIL-STD-1553",1000000,"MIL-STD-1553",1000000,"MIL-STD-1553",1000000,"MIL-STD-1553",1000000,"MIL-STD-1553",1000000,"MIL-STD-1553",1000000,"MIL-STD-1553",1000000,"MIL-STD-1553",1000000,"MIL-STD-1553",1000000,"MIL-STD-1553",1000000,"MIL-STD-1553",1000000,"MIL-STD-1553",1000000,"MIL-STD-1553",1000000,"MIL-STD-1553",1000000,"MIL-STD-1553",1000000,"MIL-STD-1553",1000000,"MIL-STD-1553",1000000,"MIL-STD-1553",1000000,"MIL-STD-1553",1000000,"MIL-STD-1553",1000000,"MIL-STD-1553",1000000,"MIL-STD-1553",1000000,"MIL-STD-1553",1000000,"MIL-STD-1553",1000000,"MIL-STD-1553",1000000,"MIL-STD-1553",1000000,"MIL-STD-1553",1000000,"MIL-STD-1553",1000000,"MIL-STD-1553",1000000,"MIL-STD-1553",1000000,"MIL-STD-1553",1000000,"MIL-STD-1553",1000000,"MIL-STD-1553",1000000,"MIL-STD-1553",1000000,"MIL-STD-1553",1000000,"MIL-STD-1553",1000000,"MIL-STD-1553",1000000,"MIL-STD-1553",1000000,"MIL-STD-1553",1000000,"MIL-STD-1553",1000000,"MIL-STD-1553",1000000,"MIL-STD-1553",1000000,"MIL-STD-1553",1000000,"MIL-STD-1553",1000000,"MIL-STD-1553",1000000,"MIL-STD-1553",1000000,"MIL-STD-1553",1000000,"MIL-STD-1553",1000000,"MIL-STD-1553",1000000,"MIL-STD-1553",1000000,"MIL-STD-1553",1000000,"MIL-STD-1553",1000000,"MIL-STD-1553",1000000,"MIL-STD-1553",1000000,"MIL-STD-1553",1000000,"MIL-STD-1553",1000000,"MIL-STD-1553",1000000,"MIL-STD-1553",1000000,"MIL-STD-1553",1000000,"MIL-STD-1553",1000000,"MIL-STD-1553",1000000,"MIL-STD-1553",1000000,"MIL-STD-1553",1000000,"MIL-STD-1553",1000000,"MIL-STD-1553",1000000,"MIL-STD-1553",1000000,"MIL-STD-1553",1000000,"MIL-STD-1553",1000000,"MIL-STD-1553",1000000,"MIL-STD-1553",1000000,"MIL-STD-1553",1000000,"MIL-STD-1553",1000000,"MIL-STD-1553",1000000,"MIL-STD-1553",1000000,"MIL-STD-1553",1000000,"MIL-STD-1553",1000000,"MIL-STD-1553",1000000,"MIL-STD-1553",1000000,"MIL-STD-1553",1000000,"MIL-STD-1553",1000000,"MIL-STD-1553",1000000,"MIL-STD-1553",1000000,"MIL-STD-1553",1000000,"MIL-STD-1553",1000000,"MIL-STD-1553",1000000,"MIL-STD-1553",1000000,"MIL-STD-1553",1000000,"MIL-STD-1553",1000000,"MIL-STD-1553",1000000,"MIL-STD-1553",1000000,"MIL-STD-1553",1000000,"MIL-STD-1553",1000000,"MIL-STD-1553",1000000,"MIL-STD-1553",1000000,"MIL-STD-1553",1000000,"MIL-STD-1553",1000000,"MIL-STD-1553",1000000,"MIL-STD-1553",1000000,"MIL-STD-1553",1000000,"MIL-STD-1553",1000000,"MIL-STD-1553",1000000,"MIL-STD-1553",1000000,"MIL-STD-1553",1000000,"MIL-STD-1553",1000000,"MIL-STD-1553",1000000,"MIL-STD-1553",1000000,"MIL-STD-1553",1000000,"MIL-STD-1553",1000000,"MIL-STD-1553",1000000,"MIL-STD-1553",1000000,"MIL-STD-1553",1000000,"MIL-STD-1553",1000000,"MIL-STD-1553",1000000,"MIL-STD-1553",1000000,"MIL-STD-1553",1000000,"MIL-STD-1553",1000000,"MIL-STD-1553",1000000,"MIL-STD-1553",1000000,"MIL-STD-1553",1000000,"MIL-STD-1553",1000000,"MIL-STD-1553",1000000,"MIL-STD-1553",1000000,"MIL-STD-1553",1000000,"MIL-STD-1553",1000000,"MIL-STD-1553",1000000,"MIL-STD-1553",1000000,"MIL-STD-1553",1000000,"MIL-STD-1553",1000000,"MIL-STD-1553",1000000,"MIL-STD-1553",1000000,"MIL-STD-1553",1000000,"MIL-STD-1553",1000000,"MIL-STD-1553",1000000,"MIL-STD-1553",1000000,"MIL-STD-1553",1000000,"MIL-STD-1553",1000000,"MIL-STD-1553",1000000,"MIL-STD-1553",1000000,"MIL-STD-1553",1000000,"MIL-STD-1553",1000000,"MIL-STD-1553",1000000,"MIL-STD-1553",1000000,"MIL-STD-1553",1000000,"MIL-STD-1553",1000000,"MIL-STD-1553",1000000,"MIL-STD-1553",1000000,"MIL-STD-1553",1000000,"MIL-STD-1553",1000000,"MIL-STD-1553",1000000,"MIL-STD-1553",1000000,"MIL-STD-1553",1000000,"MIL-STD-1553",1000000,"MIL-STD-1553",1000000,"MIL-STD-1553",1000000,"MIL-STD-1553",1000000,"MIL-STD-1553",1000000,"MIL-STD-1553",1000000,"MIL-STD-1553",1000000,"MIL-STD-1553",1000000,"MIL-STD-1553",1000000,"MIL-STD-1553",1000000,"MIL-STD-1553",1000000,"MIL-STD-1553",1000000,"MIL-STD-1553",1000000,"MIL-STD-1553",1000000,"MIL-STD-1553",1000000,"MIL-STD-1553",1000000,"MIL-STD-1553",1000000,"MIL-STD-1553",1000000,"MIL-STD-1553",1000000,"MIL-STD-1553",1000000,"MIL-STD-1553",1000000,"MIL-STD-1553",1000000,"MIL-STD-1553",1000000,"MIL-STD-1553",1000000,"MIL-STD-1553",1000000,"MIL-STD-1553",1000000,"MIL-STD-1553",1000000,"MIL-STD-1553",1000000,"MIL-STD-1553",1000000,"MIL-STD-1553",1000000,"MIL-STD-1553",1000000,"MIL-STD-1553",1000000,"MIL-STD-1553",1000000,"MIL-STD-1553",1000000,"MIL-STD-1553",1000000,"MIL-STD-1553",1000000,"MIL-STD-1553",1000000,"MIL-STD-1553",1000000,"MIL-STD-1553",1000000,"MIL-STD-1553",1000000,"MIL-STD-1553",1000000,"MIL-STD-1553",1000000,"MIL-STD-1553",1000000,"MIL-STD-1553",1000000,"MIL-STD-1553",1000000,"MIL-STD-1553",1000000,"MIL-STD-1553",1000000,"MIL-STD-1553",1000000,"MIL-STD-1553",1000000,"MIL-STD-1553",1000000,"MIL-STD-1553",1000000,"MIL-STD-1553",1000000,"MIL-STD-1553",1000000,"MIL-STD-1553",1000000,"MIL-STD-1553",1000000,"MIL-STD-1553",1000000,"MIL-STD-1553",1000000,"MIL-STD-1553",1000000,"MIL-STD-1553",1000000,"MIL-STD-1553",1000000,"MIL-STD-1553",1000000,"MIL-STD-1553",1000000,"MIL-STD-1553",1000000,"MIL-STD-1553",1000000,"MIL-STD-1553",1000000,"MIL-STD-1553",1000000,"MIL-STD-1553",1000000,"MIL-STD-1553",1000000,"MIL-STD-1553",1000000,"MIL-STD-1553",1000000,"MIL-STD-1553",1000000,"MIL-STD-1553",1000000,"MIL-STD-1553",1000000,"MIL-STD-1553",1000000,"MIL-STD-1553",1000000,"MIL-STD-1553",1000000,"MIL-STD-1553",1000000,"MIL-STD-1553",1000000,"MIL-STD-1553",1000000,"MIL-STD-1553",1000000,"MIL-STD-1553",1000000,"MIL-STD-1553",1000000,"MIL-STD-1553",1000000,"MIL-STD-1553",1000000,"MIL-STD-1553",1000000,"MIL-STD-1553",1000000,"MIL-STD-1553",1000000,"MIL-STD-1553",1000000,"MIL-STD-1553",1000000,"MIL-STD-1553",1000000,"MIL-STD-1553",1000000,"MIL-STD-1553",1000000,"MIL-STD-1553",1000000,"MIL-STD-1553",1000000,"MIL-STD-1553",1000000,"MIL-STD-1553",1000000,"MIL-STD-1553",1000000,"MIL-STD-1553",1000000,"MIL-STD-1553",1000000,"MIL-STD-1553",1000000,"MIL-STD-1553",1000000,"MIL-STD-1553",1000000,"MIL-STD-1553",1000000,"MIL-STD-1553",1000000,"MIL-STD-1553",1000000,"MIL-STD-1553",1000000,"MIL-STD-1553",1000000,"MIL-STD-1553",1000000,"MIL-STD-1553",1000000,"MIL-STD-1553",1000000,"MIL-STD-1553",1000000,"MIL-STD-1553",1000000,"MIL-STD-1553",1000000,"MIL-STD-1553",1000000,"MIL-STD-1553",1000000,"MIL-STD-1553",1000000,"MIL-STD-1553",1000000,"MIL-STD-1553",1000000,"MIL-STD-1553",1000000,"MIL-STD-1553",1000000,"MIL-STD-1553",1000000,"MIL-STD-1553",1000000,"MIL-STD-1553",1000000,"MIL-STD-1553",1000000,"MIL-STD-1553",1000000,"MIL-STD-1553",1000000,"MIL-STD-1553",1000000,"MIL-STD-1553",1000000,"MIL-STD-1553",1000000,"MIL-STD-1553",1000000,"MIL-STD-1553",1000000,"MIL-STD-1553",1000000,"MIL-STD-1553",1000000,"MIL-STD-1553",1000000,"MIL-STD-1553",1000000,"MIL-STD-1553",1000000,"MIL-STD-1553",1000000,"MIL-STD-1553",1000000,"MIL-STD-1553",1000000,"MIL-STD-1553",1000000,"MIL-STD-1553",1000000,"MIL-STD-1553",1000000,"MIL-STD-1553",1000000,"MIL-STD-1553",1000000,"MIL-STD-1553",1000000,"MIL-STD-1553",1000000,"MIL-STD-1553",1000000,"MIL-STD-1553",1000000,"MIL-STD-1553",1000000,"MIL-STD-1553",1000000,"MIL-STD-1553",1000000,"MIL-STD-1553",1000000,"MIL-STD-1553",1000000,"MIL-STD-1553",1000000,"MIL-STD-1553",1000000,"MIL-STD-1553",1000000,"MIL-STD-1553",1000000,"MIL-STD-1553",1000000,"MIL-STD-1553",1000000,"MIL-STD-1553",1000000,"MIL-STD-1553",1000000,"MIL-STD-1553",1000000,"MIL-STD-1553",1000000,"MIL-STD-1553",1000000,"MIL-STD-1553",1000000,"MIL-STD-1553",1000000,"MIL-STD-1553",1000000,"MIL-STD-1553",1000000,"MIL-STD-1553",1000000,"MIL-STD-1553",1000000,"MIL-STD-1553",1000000,"MIL-STD-1553",1000000,"MIL-STD-1553",1000000,"MIL-STD-1553",1000000,"MIL-STD-1553",1000000,"MIL-STD-1553",1000000,"MIL-STD-1553",1000000,"MIL-STD-1553",1000000,"MIL-STD-1553",1000000,"MIL-STD-1553",1000000,"MIL-STD-1553",1000000,"MIL-STD-1553",1000000,"MIL-STD-1553",1000000,"MIL-STD-1553",1000000,"MIL-STD-1553",1000000,"MIL-STD-1553",1000000,"MIL-STD-1553",1000000,"MIL-STD-1553",1000000,"MIL-STD-1553",1000000,"MIL-STD-1553",1000000,"MIL-STD-1553",1000000,"MIL-STD-1553",1000000,"MIL-STD-1553",1000000,"MIL-STD-1553",1000000,"MIL-STD-1553",1000000,"MIL-STD-1553",1000000,"MIL-STD-1553",1000000,"MIL-STD-1553",1000000,"MIL-STD-1553",1000000,"MIL-STD-1553",1000000,"MIL-STD-1553",1000000,"MIL-STD-1553",1000000,"MIL-STD-1553",1000000,"MIL-STD-1553",1000000,"MIL-STD-1553",1000000,"MIL-STD-1553",1000000,"MIL-STD-1553",1000000,"MIL-STD-1553",1000000,"MIL-STD-1553",1000000,"MIL-STD-1553",1000000,"MIL-STD-1553",1000000,"MIL-STD-1553",1000000,"MIL-STD-1553",1000000,"MIL-STD-1553",1000000,"MIL-STD-1553",1000000,"MIL-STD-1553",1000000,"MIL-STD-1553",1000000,"MIL-STD-1553",1000000,"MIL-STD-1553",1000000,"MIL-STD-1553",1000000,"MIL-STD-1553",1000000,"MIL-STD-1553",1000000,"MIL-STD-1553",1000000,"MIL-STD-1553",1000000,"MIL-STD-1553",1000000,"MIL-STD-1553",1000000,"MIL-STD-1553",1000000,"MIL-STD-1553",1000000,"MIL-STD-1553",1000000,"MIL-STD-1553",1000000,"MIL-STD-1553",1000000,"MIL-STD-1553",1000000,"MIL-STD-1553",1000000,"MIL-STD-1553",1000000,"MIL-STD-1553",1000000,"MIL-STD-1553",1000000,"MIL-STD-1553",1000000,"MIL-STD-1553",1000000,"MIL-STD-1553",1000000,"MIL-STD-1553",1000000,"MIL-STD-1553",1000000,"MIL-STD-1553",1000000,"MIL-STD-1553",1000000,"MIL-STD-1553",1000000,"MIL-STD-1553",1000000,"MIL-STD-1553",1000000,"MIL-STD-1553",1000000,"MIL-STD-1553",1000000,"MIL-STD-1553",1000000,"MIL-STD-1553",1000000,"MIL-STD-1553",1000000,"MIL-STD-1553",1000000,"MIL-STD-1553",1000000,"MIL-STD-1553",1000000,"MIL-STD-1553",1000000,"MIL-STD-1553",1000000,"MIL-STD-1553",1000000,"MIL-STD-1553",1000000,"MIL-STD-1553",1000000,"MIL-STD-1553",1000000,"MIL-STD-1553",1000000,"MIL-STD-1553",1000000,"MIL-STD-1553",1000000,"MIL-STD-1553",1000000,"MIL-STD-1553",1000000,"MIL-STD-1553",1000000,"MIL-STD-1553",1000000,"MIL-STD-1553",1000000,"MIL-STD-1553",1000000,"MIL-STD-1553",1000000,"MIL-STD-1553",1000000,"MIL-STD-1553",1000000,"MIL-STD-1553",1000000,"MIL-STD-1553",1000000,"MIL-STD-1553",1000000,"MIL-STD-1553",1000000,"MIL-STD-1553",1000000,"MIL-STD-1553",1000000,"MIL-STD-1553",1000000,"MIL-STD-1553",1000000,"MIL-STD-1553",1000000,"MIL-STD-1553",1000000,"MIL-STD-1553",1000000,"MIL-STD-1553",1000000,"MIL-STD-1553",1000000,"MIL-STD-1553",1000000,"MIL-STD-1553",1000000,"MIL-STD-1553",1000000,"MIL-STD-1553",1000000,"MIL-STD-1553",1000000,"MIL-STD-1553",1000000,"MIL-STD-1553",1000000,"MIL-STD-1553",1000000,"MIL-STD-1553",1000000,"MIL-STD-1553",1000000,"MIL-STD-1553",1000000,"MIL-STD-1553",1000000,"MIL-STD-1553",1000000,"MIL-STD-1553",1000000,"MIL-STD-1553",1000000,"MIL-STD-1553",1000000,"MIL-STD-1553",1000000,"MIL-STD-1553",1000000,"MIL-STD-1553",1000000,"MIL-STD-1553",1000000,"MIL-STD-1553",1000000,"MIL-STD-1553",1000000,"MIL-STD-1553",1000000,"MIL-STD-1553",1000000,"MIL-STD-1553",1000000,"MIL-STD-1553",1000000,"MIL-STD-1553",1000000,"MIL-STD-1553",1000000,"MIL-STD-1553",1000000,"MIL-STD-1553",1000000,"MIL-STD-1553",1000000,"MIL-STD-1553",1000000,"MIL-STD-1553",1000000,"MIL-STD-1553",1000000,"MIL-STD-1553",1000000,"MIL-STD-1553",1000000,"MIL-STD-1553",1000000,"MIL-STD-1553",1000000,"MIL-STD-1553",1000000,"MIL-STD-1553",1000000,"MIL-STD-1553",1000000,"MIL-STD-1553",1000000,"MIL-STD-1553",1000000,"MIL-STD-1553",1000000,"MIL-STD-1553",1000000,"MIL-STD-1553",1000000,"MIL-STD-1553",1000000,"MIL-STD-1553",1000000,"MIL-STD-1553",1000000,"MIL-STD-1553",1000000,"MIL-STD-1553",1000000,"MIL-STD-1553",1000000,"MIL-STD-1553",1000000,"MIL-STD-1553",1000000,"MIL-STD-1553",1000000,"MIL-STD-1553",1000000,"MIL-STD-1553",1000000,"MIL-STD-1553",1000000,"MIL-STD-1553",1000000,"MIL-STD-1553",1000000,"MIL-STD-1553",1000000,"MIL-STD-1553",1000000,"MIL-STD-1553",1000000,"MIL-STD-1553",1000000,"MIL-STD-1553",1000000,"MIL-STD-1553",1000000,"MIL-STD-1553",1000000,"MIL-STD-1553",1000000,"MIL-STD-1553",1000000,"MIL-STD-1553",1000000,"MIL-STD-1553",1000000,"MIL-STD-1553",1000000,"MIL-STD-1553",1000000,"MIL-STD-1553",1000000,"MIL-STD-1553",1000000,"MIL-STD-1553",1000000,"MIL-STD-1553",1000000,"MIL-STD-1553",1000000,"MIL-STD-1553",1000000,"MIL-STD-1553",1000000,"MIL-STD-1553",1000000,"MIL-STD-1553",1000000,"MIL-STD-1553",1000000,"MIL-STD-1553",1000000,"MIL-STD-1553",1000000,"MIL-STD-1553",1000000,"MIL-STD-1553",1000000,"MIL-STD-1553",1000000,"MIL-STD-1553",1000000,"MIL-STD-1553",1000000,"MIL-STD-1553",1000000,"MIL-STD-1553",1000000,"MIL-STD-1553",1000000,"MIL-STD-1553",1000000,"MIL-STD-1553",1000000,"MIL-STD-1553",1000000,"MIL-STD-1553",1000000,"MIL-STD-1553",1000000,"MIL-STD-1553",1000000,"MIL-STD-1553",1000000,"MIL-STD-1553",1000000,"MIL-STD-1553",1000000,"MIL-STD-1553",1000000,"MIL-STD-1553",1000000,"MIL-STD-1553",1000000,"MIL-STD-1553",1000000,"MIL-STD-1553",1000000,"MIL-STD-1553",1000000,"MIL-STD-1553",1000000,"MIL-STD-1553",1000000,"MIL-STD-1553",1000000,"MIL-STD-1553",1000000,"MIL-STD-1553",1000000,"MIL-STD-1553",1000000,"MIL-STD-1553",1000000,"MIL-STD-1553",1000000,"MIL-STD-1553",1000000,"MIL-STD-1553",1000000,"MIL-STD-1553",1000000,"MIL-STD-1553",1000000,"MIL-STD-1553",1000000,"MIL-STD-1553",1000000,"MIL-STD-1553",1000000,"MIL-STD-1553",1000000,"MIL-STD-1553",1000000,"MIL-STD-1553",1000000,"MIL-STD-1553",1000000,"MIL-STD-1553",1000000,"MIL-STD-1553",1000000,"MIL-STD-1553",1000000,"MIL-STD-1553",1000000,"MIL-STD-1553",1000000,"MIL-STD-1553",1000000,"MIL-STD-1553",1000000,"MIL-STD-1553",1000000,"MIL-STD-1553",1000000,"MIL-STD-1553",1000000,"MIL-STD-1553",1000000,"MIL-STD-1553",1000000,"MIL-STD-1553",1000000,"MIL-STD-1553",1000000,"MIL-STD-1553",1000000,"MIL-STD-1553",1000000,"MIL-STD-1553",1000000,"MIL-STD-1553",1000000,"MIL-STD-1553",1000000,"MIL-STD-1553",1000000,"MIL-STD-1553",1000000,"MIL-STD-1553",1000000,"MIL-STD-1553",1000000,"MIL-STD-1553",1000000,"MIL-STD-1553",1000000,"MIL-STD-1553",1000000,"MIL-STD-1553",1000000,"MIL-STD-1553",1000000,"MIL-STD-1553",1000000,"MIL-STD-1553",1000000,"MIL-STD-1553",1000000,"MIL-STD-1553",1000000,"MIL-STD-1553",1000000,"MIL-STD-1553",1000000,"MIL-STD-1553",1000000,"MIL-STD-1553",1000000,"MIL-STD-1553",1000000,"MIL-STD-1553",1000000,"MIL-STD-1553",1000000,"MIL-STD-1553",1000000,"MIL-STD-1553",1000000,"MIL-STD-1553",1000000,"MIL-STD-1553",1000000,"MIL-STD-1553",1000000,"MIL-STD-1553",1000000,"MIL-STD-1553",1000000,"MIL-STD-1553",1000000,"MIL-STD-1553",1000000,"MIL-STD-1553",1000000,"MIL-STD-1553",1000000,"MIL-STD-1553",1000000,"MIL-STD-1553",1000000,"MIL-STD-1553",1000000,"MIL-STD-1553",1000000,"MIL-STD-1553",1000000,"MIL-STD-1553",1000000,"MIL-STD-1553",1000000,"MIL-STD-1553",1000000,"MIL-STD-1553",1000000,"MIL-STD-1553",1000000,"MIL-STD-1553",1000000,"MIL-STD-1553",1000000,"MIL-STD-1553",1000000,"MIL-STD-1553",1000000,"MIL-STD-1553",1000000,"MIL-STD-1553",1000000,"MIL-STD-1553",1000000,"MIL-STD-1553",1000000,"MIL-STD-1553",1000000,"MIL-STD-1553",1000000,"MIL-STD-1553",1000000,"MIL-STD-1553",1000000,"MIL-STD-1553",1000000,"MIL-STD-1553",1000000,"MIL-STD-1553",1000000,"MIL-STD-1553",1000000,"MIL-STD-1553",1000000,"MIL-STD-1553",1000000,"MIL-STD-1553",1000000,"MIL-STD-1553",1000000,"MIL-STD-1553",1000000,"MIL-STD-1553",1000000,"MIL-STD-1553",1000000,"MIL-STD-1553",1000000,"MIL-STD-1553",1000000,"MIL-STD-1553",1000000,"MIL-STD-1553",1000000,"MIL-STD-1553",1000000,"MIL-STD-1553",1000000,"MIL-STD-1553",1000000,"MIL-STD-1553",1000000,"MIL-STD-1553",1000000,"MIL-STD-1553",1000000,"MIL-STD-1553",1000000,"MIL-STD-1553",1000000,"MIL-STD-1553",1000000,"MIL-STD-1553",1000000,"MIL-STD-1553",1000000,"MIL-STD-1553",1000000,"MIL-STD-1553",1000000,"MIL-STD-1553",1000000,"MIL-STD-1553",1000000,"MIL-STD-1553",1000000,"MIL-STD-1553",1000000,"MIL-STD-1553",1000000,"MIL-STD-1553",1000000,"MIL-STD-1553",1000000,"MIL-STD-1553",1000000,"MIL-STD-1553",1000000,"MIL-STD-1553",1000000,"MIL-STD-1553",1000000,"MIL-STD-1553",1000000,"MIL-STD-1553",1000000,"MIL-STD-1553",1000000,"MIL-STD-1553",1000000,"MIL-STD-1553",1000000,"MIL-STD-1553",1000000,"MIL-STD-1553",1000000,"MIL-STD-1553",1000000,"MIL-STD-1553",1000000,"MIL-STD-1553",1000000,"MIL-STD-1553",1000000,"MIL-STD-1553",1000000,"MIL-STD-1553",1000000,"MIL-STD-1553",1000000,"MIL-STD-1553",1000000,"MIL-STD-1553",1000000,"MIL-STD-1553",1000000,"MIL-STD-1553",1000000,"MIL-STD-1553",1000000,"MIL-STD-1553",1000000,"MIL-STD-1553",1000000,"MIL-STD-1553",1000000,"MIL-STD-1553",1000000,"MIL-STD-1553",1000000,"MIL-STD-1553",1000000,"MIL-STD-1553",1000000,"MIL-STD-1553",1000000,"MIL-STD-1553",1000000,"MIL-STD-1553",1000000,"MIL-STD-1553",1000000,"MIL-STD-1553",1000000,"MIL-STD-1553",1000000,"MIL-STD-1553",1000000,"MIL-STD-1553",1000000,"MIL-STD-1553",1000000,"MIL-STD-1553",1000000,"MIL-STD-1553",1000000,"MIL-STD-1553",1000000,"MIL-STD-1553",1000000,"MIL-STD-1553",1000000,"MIL-STD-1553",1000000,"MIL-STD-1553",1000000,"MIL-STD-1553",1000000,"MIL-STD-1553",1000000,"MIL-STD-1553",1000000,"MIL-STD-1553",1000000,"MIL-STD-1553",1000000,"MIL-STD-1553",1000000,"MIL-STD-1553",1000000,"MIL-STD-1553",1000000,"MIL-STD-1553",1000000,"MIL-STD-1553",1000000,"MIL-STD-1553",1000000,"MIL-STD-1553",1000000,"MIL-STD-1553",1000000,"MIL-STD-1553",1000000,"MIL-STD-1553",1000000,"MIL-STD-1553",1000000,"MIL-STD-1553",1000000,"MIL-STD-1553",1000000,"MIL-STD-1553",1000000,"MIL-STD-1553",1000000,"MIL-STD-1553",1000000,"MIL-STD-1553",1000000,"MIL-STD-1553",1000000,"MIL-STD-1553",1000000,"MIL-STD-1553",1000000,"MIL-STD-1553",1000000,"MIL-STD-1553",1000000,"MIL-STD-1553",1000000,"MIL-STD-1553",1000000,"MIL-STD-1553",1000000,"MIL-STD-1553",1000000,"MIL-STD-1553",1000000,"MIL-STD-1553",1000000,"MIL-STD-1553",1000000,"MIL-STD-1553",1000000,"MIL-STD-1553",1000000,"MIL-STD-1553",1000000,"MIL-STD-1553",1000000,"MIL-STD-1553",1000000,"MIL-STD-1553",1000000,"MIL-STD-1553",1000000,"MIL-STD-1553",1000000,"MIL-STD-1553",1000000,"MIL-STD-1553",1000000,"MIL-STD-1553",1000000,"MIL-STD-1553",1000000,"MIL-STD-1553",1000000,"MIL-STD-1553",1000000,"MIL-STD-1553",1000000,"MIL-STD-1553",1000000,"MIL-STD-1553",1000000,"MIL-STD-1553",1000000,"MIL-STD-1553",1000000,"MIL-STD-1553",1000000,"MIL-STD-1553",1000000,"MIL-STD-1553",1000000,"MIL-STD-1553",1000000,"MIL-STD-1553",1000000,"MIL-STD-1553",1000000,"MIL-STD-1553",1000000,"MIL-STD-1553",1000000,"MIL-STD-1553",1000000,"MIL-STD-1553",1000000,"MIL-STD-1553",1000000,"MIL-STD-1553",1000000,"MIL-STD-1553",1000000,"MIL-STD-1553",1000000,"MIL-STD-1553",1000000,"MIL-STD-1553",1000000,"MIL-STD-1553",1000000,"MIL-STD-1553",1000000,"MIL-STD-1553",1000000,"MIL-STD-1553",1000000,"MIL-STD-1553",1000000,"MIL-STD-1553",1000000,"MIL-STD-1553",1000000,"MIL-STD-1553",1000000,"MIL-STD-1553",1000000,"MIL-STD-1553",1000000,"MIL-STD-1553",1000000,"MIL-STD-1553",1000000,"MIL-STD-1553",1000000,"MIL-STD-1553",1000000,"MIL-STD-1553",1000000,"MIL-STD-1553",1000000,"MIL-STD-1553",1000000,"MIL-STD-1553",1000000,"MIL-STD-1553",1000000,"MIL-STD-1553",1000000,"MIL-STD-1553",1000000,"MIL-STD-1553",1000000,"MIL-STD-1553",1000000,"MIL-STD-1553",1000000,"MIL-STD-1553",1000000,"MIL-STD-1553",1000000,"MIL-STD-1553",1000000,"MIL-STD-1553",1000000,"MIL-STD-1553",1000000,"MIL-STD-1553",1000000,"MIL-STD-1553",1000000,"MIL-STD-1553",1000000,"MIL-STD-1553",1000000,"MIL-STD-1553",1000000,"MIL-STD-1553",1000000,"MIL-STD-1553",1000000,"MIL-STD-1553",1000000,"MIL-STD-1553",1000000,"MIL-STD-1553",1000000,"MIL-STD-1553",1000000,"MIL-STD-1553",1000000,"MIL-STD-1553",1000000,"MIL-STD-1553",1000000,"MIL-STD-1553",1000000,"MIL-STD-1553",1000000,"MIL-STD-1553",1000000,"MIL-STD-1553",1000000,"MIL-STD-1553",1000000,"MIL-STD-1553",1000000,"MIL-STD-1553",1000000,"MIL-STD-1553",1000000,"MIL-STD-1553",1000000,"MIL-STD-1553",1000000,"MIL-STD-1553",1000000,"MIL-STD-1553",1000000,"MIL-STD-1553",1000000,"MIL-STD-1553",1000000,"MIL-STD-1553",1000000,"MIL-STD-1553",1000000,"MIL-STD-1553",1000000,"MIL-STD-1553",1000000,"MIL-STD-1553",1000000,"MIL-STD-1553",1000000,"MIL-STD-1553",1000000,"MIL-STD-1553",1000000,"MIL-STD-1553",1000000,"MIL-STD-1553",1000000,"MIL-STD-1553",1000000,"MIL-STD-1553",1000000,"MIL-STD-1553",1000000,"MIL-STD-1553",1000000,"MIL-STD-1553",1000000,"MIL-STD-1553",1000000,"MIL-STD-1553",1000000,"MIL-STD-1553",1000000,"MIL-STD-1553",1000000,"MIL-STD-1553",1000000,"MIL-STD-1553",1000000,"MIL-STD-1553",1000000,"MIL-STD-1553",1000000,"MIL-STD-1553",1000000,"MIL-STD-1553",1000000,"MIL-STD-1553",1000000,"MIL-STD-1553",1000000,"MIL-STD-1553",1000000,"MIL-STD-1553",1000000,"MIL-STD-1553",1000000,"MIL-STD-1553",1000000,"MIL-STD-1553",1000000,"MIL-STD-1553",1000000,"MIL-STD-1553",1000000,"MIL-STD-1553",1000000,"MIL-STD-1553",1000000,"MIL-STD-1553",1000000,"MIL-STD-1553",1000000,"MIL-STD-1553",1000000,"MIL-STD-1553",1000000,"MIL-STD-1553",1000000,"MIL-STD-1553",1000000,"MIL-STD-1553",1000000,"MIL-STD-1553",1000000,"MIL-STD-1553",1000000,"MIL-STD-1553",1000000,"MIL-STD-1553",1000000,"MIL-STD-1553",1000000,"MIL-STD-1553",1000000,"MIL-STD-1553",1000000,"MIL-STD-1553",1000000,"MIL-STD-1553",1000000,"MIL-STD-1553",1000000,"MIL-STD-1553",1000000,"MIL-STD-1553",1000000,"MIL-STD-1553",1000000,"MIL-STD-1553",1000000,"MIL-STD-1553",1000000,"MIL-STD-1553",1000000,"MIL-STD-1553",1000000,"MIL-STD-1553",1000000,"MIL-STD-1553",1000000,"MIL-STD-1553",1000000,"MIL-STD-1553",1000000,"MIL-STD-1553",1000000,"MIL-STD-1553",1000000,"MIL-STD-1553",1000000,"MIL-STD-1553",1000000,"MIL-STD-1553",1000000,"MIL-STD-1553",1000000,"MIL-STD-1553",1000000,"MIL-STD-1553",1000000,"MIL-STD-1553",1000000,"MIL-STD-1553",1000000,"MIL-STD-1553",1000000,"MIL-STD-1553",1000000,"MIL-STD-1553",1000000,"MIL-STD-1553",1000000,"MIL-STD-1553",1000000,"MIL-STD-1553",1000000,"MIL-STD-1553",1000000,"MIL-STD-1553",1000000,"MIL-STD-1553",1000000,"MIL-STD-1553",1000000,"MIL-STD-1553",1000000,"MIL-STD-1553",1000000,"MIL-STD-1553",1000000,"MIL-STD-1553",1000000,"MIL-STD-1553",1000000,"MIL-STD-1553",1000000,"MIL-STD-1553",1000000,"MIL-STD-1553",1000000,"MIL-STD-1553",1000000,"MIL-STD-1553",1000000,"MIL-STD-1553",1000000,"MIL-STD-1553",1000000,"MIL-STD-1553",1000000,"MIL-STD-1553",1000000,"MIL-STD-1553",1000000,"MIL-STD-1553",1000000,"MIL-STD-1553",1000000,"MIL-STD-1553",1000000,"MIL-STD-1553",1000000,"MIL-STD-1553",1000000,"MIL-STD-1553",1000000,"MIL-STD-1553",1000000,"MIL-STD-1553",1000000,"MIL-STD-1553",1000000,"MIL-STD-1553",1000000,"MIL-STD-1553",1000000,"MIL-STD-1553",1000000,"MIL-STD-1553",1000000,"MIL-STD-1553",1000000,"MIL-STD-1553",1000000,"MIL-STD-1553",1000000,"MIL-STD-1553",1000000,"MIL-STD-1553",1000000,"MIL-STD-1553",1000000,"MIL-STD-1553",1000000,"MIL-STD-1553",1000000,"MIL-STD-1553",1000000,"MIL-STD-1553",1000000,"MIL-STD-1553",1000000,"MIL-STD-1553",1000000,"MIL-STD-1553",1000000,"MIL-STD-1553",1000000,"MIL-STD-1553",1000000,"MIL-STD-1553",1000000,"MIL-STD-1553",1000000,"MIL-STD-1553",1000000,"MIL-STD-1553",1000000,"MIL-STD-1553",1000000,"MIL-STD-1553",1000000,"MIL-STD-1553",1000000,"MIL-STD-1553",1000000,"MIL-STD-1553",1000000,"MIL-STD-1553",1000000,"MIL-STD-1553",1000000,"MIL-STD-1553",1000000,"MIL-STD-1553",1000000,"MIL-STD-1553",1000000,"MIL-STD-1553",1000000,"MIL-STD-1553",1000000,"MIL-STD-1553",1000000,"MIL-STD-1553",1000000,"MIL-STD-1553",1000000,"MIL-STD-1553",1000000,"MIL-STD-1553",1000000,"MIL-STD-1553",1000000,"MIL-STD-1553",1000000,"MIL-STD-1553",1000000,"MIL-STD-1553",1000000,"MIL-STD-1553",1000000,"MIL-STD-1553",1000000,"MIL-STD-1553",1000000,"MIL-STD-1553",1000000,"MIL-STD-1553",1000000,"MIL-STD-1553",1000000,"MIL-STD-1553",1000000,"MIL-STD-1553",1000000,"MIL-STD-1553",1000000,"MIL-STD-1553",1000000,"MIL-STD-1553",1000000,"MIL-STD-1553",1000000,"MIL-STD-1553",1000000,"MIL-STD-1553",1000000,"MIL-STD-1553",1000000,"MIL-STD-1553",1000000,"MIL-STD-1553",1000000,"MIL-STD-1553",1000000,"MIL-STD-1553",1000000,"MIL-STD-1553",1000000,"MIL-STD-1553",1000000,"MIL-STD-1553",1000000,"MIL-STD-1553",1000000,"MIL-STD-1553",1000000,"MIL-STD-1553",1000000,"MIL-STD-1553",1000000,"MIL-STD-1553",1000000,"MIL-STD-1553",1000000,"MIL-STD-1553",1000000,"MIL-STD-1553",1000000,"MIL-STD-1553",1000000,"MIL-STD-1553",1000000,"MIL-STD-1553",1000000,"MIL-STD-1553",1000000,"MIL-STD-1553",1000000,"MIL-STD-1553",1000000,"MIL-STD-1553",1000000,"MIL-STD-1553",1000000,"MIL-STD-1553",1000000,"MIL-STD-1553",1000000,"MIL-STD-1553",1000000,"MIL-STD-1553",1000000,"MIL-STD-1553",1000000,"MIL-STD-1553",1000000,"MIL-STD-1553",1000000,"MIL-STD-1553",1000000,"MIL-STD-1553",1000000,"MIL-STD-1553",1000000,"MIL-STD-1553",1000000,"MIL-STD-1553",1000000,"MIL-STD-1553",1000000,"MIL-STD-1553",1000000,"MIL-STD-1553",1000000,"MIL-STD-1553",1000000,"MIL-STD-1553",1000000,"MIL-STD-1553",1000000,"MIL-STD-1553",1000000,"MIL-STD-1553",1000000,"MIL-STD-1553",1000000,"MIL-STD-1553",1000000,"MIL-STD-1553",1000000,"MIL-STD-1553",1000000,"MIL-STD-1553",1000000,"MIL-STD-1553",1000000,"MIL-STD-1553",1000000,"MIL-STD-1553",1000000,"MIL-STD-1553",1000000,"MIL-STD-1553",1000000,"MIL-STD-1553",1000000,"MIL-STD-1553",1000000,"MIL-STD-1553",1000000,"MIL-STD-1553",1000000,"MIL-STD-1553",1000000,"MIL-STD-1553",1000000,"MIL-STD-1553",1000000,"MIL-STD-1553",1000000,"MIL-STD-1553",1000000,"MIL-STD-1553",1000000,"MIL-STD-1553",1000000,"MIL-STD-1553",1000000,"MIL-STD-1553",1000000,"MIL-STD-1553",1000000,"MIL-STD-1553",1000000,"MIL-STD-1553",1000000,"MIL-STD-1553",1000000,"MIL-STD-1553",1000000,"MIL-STD-1553",1000000,"MIL-STD-1553",1000000,"MIL-STD-1553",1000000,"MIL-STD-1553",1000000,"MIL-STD-1553",1000000,"MIL-STD-1553",1000000,"MIL-STD-1553",1000000,"MIL-STD-1553",1000000,"MIL-STD-1553",1000000,"MIL-STD-1553",1000000,"MIL-STD-1553",1000000,"MIL-STD-1553",1000000,"MIL-STD-1553",1000000,"MIL-STD-1553",1000000,"MIL-STD-1553",1000000,"MIL-STD-1553",1000000,"MIL-STD-1553",1000000,"MIL-STD-1553",1000000,"MIL-STD-1553",1000000,"MIL-STD-1553",1000000,"MIL-STD-1553",1000000,"MIL-STD-1553",1000000,"MIL-STD-1553",1000000,"MIL-STD-1553",1000000,"MIL-STD-1553",1000000,"MIL-STD-1553",1000000,"MIL-STD-1553",1000000,"MIL-STD-1553",1000000,"MIL-STD-1553",1000000,"MIL-STD-1553",1000000,"MIL-STD-1553",1000000,"MIL-STD-1553",1000000,"MIL-STD-1553",1000000,"MIL-STD-1553",1000000,"MIL-STD-1553",1000000,"MIL-STD-1553",1000000,"MIL-STD-1553",1000000,"MIL-STD-1553",1000000,"MIL-STD-1553",1000000,"MIL-STD-1553",1000000,"MIL-STD-1553",1000000,"MIL-STD-1553",1000000,"MIL-STD-1553",1000000,"MIL-STD-1553",1000000,"MIL-STD-1553",1000000,"MIL-STD-1553",1000000,"MIL-STD-1553",1000000,"MIL-STD-1553",1000000,"MIL-STD-1553",1000000,"MIL-STD-1553",1000000,"MIL-STD-1553",1000000,"MIL-STD-1553",1000000,"MIL-STD-1553",1000000,"MIL-STD-1553",1000000,"MIL-STD-1553",1000000,"MIL-STD-1553",1000000,"MIL-STD-1553",1000000,"MIL-STD-1553",1000000,"MIL-STD-1553",1000000,"MIL-STD-1553",1000000,"MIL-STD-1553",1000000,"MIL-STD-1553",1000000,"MIL-STD-1553",1000000,"MIL-STD-1553",1000000,"MIL-STD-1553",1000000,"MIL-STD-1553",1000000,"MIL-STD-1553",1000000,"MIL-STD-1553",1000000,"MIL-STD-1553",1000000,"MIL-STD-1553",1000000,"MIL-STD-1553",1000000,"MIL-STD-1553",1000000,"MIL-STD-1553",1000000,"MIL-STD-1553",1000000,"MIL-STD-1553",1000000,"MIL-STD-1553",1000000,"MIL-STD-1553",1000000,"MIL-STD-1553",1000000,"MIL-STD-1553",1000000,"MIL-STD-1553",1000000,"MIL-STD-1553",1000000,"MIL-STD-1553",1000000,"MIL-STD-1553",1000000,"MIL-STD-1553",1000000,"MIL-STD-1553",1000000,"MIL-STD-1553",1000000,"MIL-STD-1553",1000000,"MIL-STD-1553",1000000,"MIL-STD-1553",1000000,"MIL-STD-1553",1000000,"MIL-STD-1553",1000000,"MIL-STD-1553",1000000,"MIL-STD-1553",1000000,"MIL-STD-1553",1000000,"MIL-STD-1553",1000000,"MIL-STD-1553",1000000,"MIL-STD-1553",1000000,"MIL-STD-1553",1000000,"MIL-STD-1553",1000000,"MIL-STD-1553",1000000,"MIL-STD-1553",1000000,"MIL-STD-1553",1000000,"MIL-STD-1553",1000000,"MIL-STD-1553",1000000,"MIL-STD-1553",1000000,"MIL-STD-1553",1000000,"MIL-STD-1553",1000000,"MIL-STD-1553",1000000,"MIL-STD-1553",1000000,"MIL-STD-1553",1000000,"MIL-STD-1553",1000000,"MIL-STD-1553",1000000,"MIL-STD-1553",1000000,"MIL-STD-1553",1000000,"MIL-STD-1553",1000000,"MIL-STD-1553",1000000,"MIL-STD-1553",1000000,"MIL-STD-1553",1000000,"MIL-STD-1553",1000000,"MIL-STD-1553",1000000,"MIL-STD-1553",1000000,"MIL-STD-1553",1000000,"MIL-STD-1553",1000000,"MIL-STD-1553",1000000,"MIL-STD-1553",1000000,"MIL-STD-1553",1000000,"MIL-STD-1553",1000000,"MIL-STD-1553",1000000,"MIL-STD-1553",1000000,"MIL-STD-1553",1000000,"MIL-STD-1553",1000000,"MIL-STD-1553",1000000,"MIL-STD-1553",1000000,"MIL-STD-1553",1000000,"MIL-STD-1553",1000000,"MIL-STD-1553",1000000,"MIL-STD-1553",1000000,"MIL-STD-1553",1000000,"MIL-STD-1553",1000000,"MIL-STD-1553",1000000,"MIL-STD-1553",1000000,"MIL-STD-1553",1000000,"MIL-STD-1553",1000000,"MIL-STD-1553",1000000,"MIL-STD-1553",1000000,"MIL-STD-1553",1000000,"MIL-STD-1553",1000000,"MIL-STD-1553",1000000,"MIL-STD-1553",1000000,"MIL-STD-1553",1000000,"MIL-STD-1553",1000000,"MIL-STD-1553",1000000,"MIL-STD-1553",1000000,"MIL-STD-1553",1000000,"MIL-STD-1553",1000000,"MIL-STD-1553",1000000,"MIL-STD-1553",1000000,"MIL-STD-1553",1000000,"MIL-STD-1553",1000000,"MIL-STD-1553",1000000,"MIL-STD-1553",1000000,"MIL-STD-1553",1000000,"MIL-STD-1553",1000000,"MIL-STD-1553",1000000,"MIL-STD-1553",1000000,"MIL-STD-1553",1000000,"MIL-STD-1553",1000000,"MIL-STD-1553",1000000,"MIL-STD-1553",1000000,"MIL-STD-1553",1000000,"MIL-STD-1553",1000000,"MIL-STD-1553",1000000,"MIL-STD-1553",1000000,"MIL-STD-1553",1000000,"MIL-STD-1553",1000000,"MIL-STD-1553",1000000,"MIL-STD-1553",1000000,"MIL-STD-1553",1000000,"MIL-STD-1553",1000000,"MIL-STD-1553",1000000,"MIL-STD-1553",1000000,"MIL-STD-1553",1000000,"MIL-STD-1553",1000000,"MIL-STD-1553",1000000,"MIL-STD-1553",1000000,"MIL-STD-1553",1000000,"MIL-STD-1553",1000000,"MIL-STD-1553",1000000,"MIL-STD-1553",1000000,"MIL-STD-1553",1000000,"MIL-STD-1553",1000000,"MIL-STD-1553",1000000,"MIL-STD-1553",1000000,"MIL-STD-1553",1000000,"MIL-STD-1553",1000000,"MIL-STD-1553",1000000,"MIL-STD-1553",1000000,"MIL-STD-1553",1000000,"MIL-STD-1553",1000000,"MIL-STD-1553",1000000,"MIL-STD-1553",1000000,"MIL-STD-1553",1000000,"MIL-STD-1553",1000000,"MIL-STD-1553",1000000,"MIL-STD-1553",1000000,"MIL-STD-1553",1000000,"MIL-STD-1553",1000000,"MIL-STD-1553",1000000,"MIL-STD-1553",1000000,"MIL-STD-1553",1000000,"MIL-STD-1553",1000000,"MIL-STD-1553",1000000,"MIL-STD-1553",1000000,"MIL-STD-1553",1000000,"MIL-STD-1553",1000000,"MIL-STD-1553",1000000,"MIL-STD-1553",1000000,"MIL-STD-1553",1000000,"MIL-STD-1553",1000000,"MIL-STD-1553",1000000,"MIL-STD-1553",1000000,"MIL-STD-1553",1000000,"MIL-STD-1553",1000000,"MIL-STD-1553",1000000,"MIL-STD-1553",1000000,"MIL-STD-1553",1000000,"MIL-STD-1553",1000000,"MIL-STD-1553",1000000,"MIL-STD-1553",1000000,"MIL-STD-1553",1000000,"MIL-STD-1553",1000000,"MIL-STD-1553",1000000,"MIL-STD-1553",1000000,"MIL-STD-1553",1000000,"MIL-STD-1553",1000000,"MIL-STD-1553",1000000,"MIL-STD-1553",1000000,"MIL-STD-1553",1000000,"MIL-STD-1553",1000000,"MIL-STD-1553",1000000,"MIL-STD-1553",1000000,"MIL-STD-1553",1000000,"MIL-STD-1553",1000000,"MIL-STD-1553",1000000,"MIL-STD-1553",1000000,"MIL-STD-1553",1000000,"MIL-STD-1553",1000000,"MIL-STD-1553",1000000,"MIL-STD-1553",1000000,"MIL-STD-1553",1000000,"MIL-STD-1553",1000000,"MIL-STD-1553",1000000,"MIL-STD-1553",1000000,"MIL-STD-1553",1000000,"MIL-STD-1553",1000000,"MIL-STD-1553",1000000,"MIL-STD-1553",1000000,"MIL-STD-1553",1000000,"MIL-STD-1553",1000000,"MIL-STD-1553",1000000,"MIL-STD-1553",1000000,"MIL-STD-1553",1000000,"MIL-STD-1553",1000000,"MIL-STD-1553",1000000,"MIL-STD-1553",1000000,"MIL-STD-1553",1000000,"MIL-STD-1553",1000000,"MIL-STD-1553",1000000,"MIL-STD-1553",1000000,"MIL-STD-1553",1000000,"MIL-STD-1553",1000000,"MIL-STD-1553",1000000,"MIL-STD-1553",1000000,"MIL-STD-1553",1000000,"MIL-STD-1553",1000000,"MIL-STD-1553",1000000,"MIL-STD-1553",1000000,"MIL-STD-1553",1000000,"MIL-STD-1553",1000000,"MIL-STD-1553",1000000,"MIL-STD-1553",1000000,"MIL-STD-1553",1000000,"MIL-STD-1553",1000000,"MIL-STD-1553",1000000,"MIL-STD-1553",1000000,"MIL-STD-1553",1000000,"MIL-STD-1553",1000000,"MIL-STD-1553",1000000,"MIL-STD-1553",1000000,"MIL-STD-1553",1000000,"MIL-STD-1553",1000000,"MIL-STD-1553",1000000,"MIL-STD-1553",1000000,"MIL-STD-1553",1000000,"MIL-STD-1553",1000000,"MIL-STD-1553",1000000,"MIL-STD-1553",1000000,"MIL-STD-1553",1000000,"MIL-STD-1553",1000000,"MIL-STD-1553",1000000,"MIL-STD-1553",1000000,"MIL-STD-1553",1000000,"MIL-STD-1553",1000000,"MIL-STD-1553",1000000,"MIL-STD-1553",1000000,"MIL-STD-1553",1000000,"MIL-STD-1553",1000000,"MIL-STD-1553",1000000,"MIL-STD-1553",1000000,"MIL-STD-1553",1000000,"MIL-STD-1553",1000000,"MIL-STD-1553",1000000,"MIL-STD-1553",1000000,"MIL-STD-1553",1000000,"MIL-STD-1553",1000000,"MIL-STD-1553",1000000,"MIL-STD-1553",1000000,"MIL-STD-1553",1000000,"MIL-STD-1553",1000000,"MIL-STD-1553",1000000,"MIL-STD-1553",1000000,"MIL-STD-1553",1000000,"MIL-STD-1553",1000000,"MIL-STD-1553",1000000,"MIL-STD-1553",1000000,"MIL-STD-1553",1000000,"MIL-STD-1553",1000000,"MIL-STD-1553",1000000,"MIL-STD-1553",1000000,"MIL-STD-1553",1000000,"MIL-STD-1553",1000000,"MIL-STD-1553",1000000,"MIL-STD-1553",1000000,"MIL-STD-1553",1000000,"MIL-STD-1553",1000000,"MIL-STD-1553",1000000,"MIL-STD-1553",1000000,"MIL-STD-1553",1000000,"MIL-STD-1553",1000000,"MIL-STD-1553",1000000,"MIL-STD-1553",1000000,"MIL-STD-1553",1000000,"MIL-STD-1553",1000000,"MIL-STD-1553",1000000,"MIL-STD-1553",1000000,"MIL-STD-1553",1000000,"MIL-STD-1553",1000000,"MIL-STD-1553",1000000,"MIL-STD-1553",1000000,"MIL-STD-1553",1000000,"MIL-STD-1553",1000000,"MIL-STD-1553",1000000,"MIL-STD-1553",1000000,"MIL-STD-1553",1000000,"MIL-STD-1553",1000000,"MIL-STD-1553",1000000,"MIL-STD-1553",1000000,"MIL-STD-1553",1000000,"MIL-STD-1553",1000000,"MIL-STD-1553",1000000,"MIL-STD-1553",1000000,"MIL-STD-1553",1000000,"MIL-STD-1553",1000000,"MIL-STD-1553",1000000,"MIL-STD-1553",1000000,"MIL-STD-1553",1000000,"MIL-STD-1553",1000000,"MIL-STD-1553",1000000,"MIL-STD-1553",1000000,"MIL-STD-1553",1000000,"MIL-STD-1553",1000000,"MIL-STD-1553",1000000,"MIL-STD-1553",1000000,"MIL-STD-1553",1000000,"MIL-STD-1553",1000000,"MIL-STD-1553",1000000,"MIL-STD-1553",1000000,"MIL-STD-1553",1000000,"MIL-STD-1553",1000000,"MIL-STD-1553",1000000,"MIL-STD-1553",1000000,"MIL-STD-1553",1000000,"MIL-STD-1553",1000000,"MIL-STD-1553",1000000,"MIL-STD-1553",1000000,"MIL-STD-1553",1000000,"MIL-STD-1553",1000000,"MIL-STD-1553",1000000,"MIL-STD-1553",1000000,"MIL-STD-1553",1000000,"MIL-STD-1553",1000000,"MIL-STD-1553",1000000,"MIL-STD-1553",1000000,"MIL-STD-1553",1000000,"MIL-STD-1553",1000000,"MIL-STD-1553",1000000,"MIL-STD-1553",1000000,"MIL-STD-1553",1000000,"MIL-STD-1553",1000000,"MIL-STD-1553",1000000,"MIL-STD-1553",1000000,"MIL-STD-1553",1000000,"MIL-STD-1553",1000000,"MIL-STD-1553",1000000,"MIL-STD-1553",1000000,"MIL-STD-1553",1000000,"MIL-STD-1553",1000000,"MIL-STD-1553",1000000,"MIL-STD-1553",1000000,"MIL-STD-1553",1000000,"MIL-STD-1553",1000000,"MIL-STD-1553",1000000,"MIL-STD-1553",1000000,"MIL-STD-1553",1000000,"MIL-STD-1553",1000000,"MIL-STD-1553",1000000,"MIL-STD-1553",1000000,"MIL-STD-1553",1000000,"MIL-STD-1553",1000000,"MIL-STD-1553",1000000,"MIL-STD-1553",1000000,"MIL-STD-1553",1000000,"MIL-STD-1553",1000000,"MIL-STD-1553",1000000,"MIL-STD-1553",1000000,"MIL-STD-1553",1000000,"MIL-STD-1553",1000000,"MIL-STD-1553",1000000,"MIL-STD-1553",1000000,"MIL-STD-1553",1000000,"MIL-STD-1553",1000000,"MIL-STD-1553",1000000,"MIL-STD-1553",1000000,"MIL-STD-1553",1000000,"MIL-STD-1553",1000000,"MIL-STD-1553",1000000,"MIL-STD-1553",1000000,"MIL-STD-1553",1000000,"MIL-STD-1553",1000000,"MIL-STD-1553",1000000,"MIL-STD-1553",1000000,"MIL-STD-1553",1000000,"MIL-STD-1553",1000000,"MIL-STD-1553",1000000,"MIL-STD-1553",1000000,"MIL-STD-1553",1000000,"MIL-STD-1553",1000000,"MIL-STD-1553",1000000,"MIL-STD-1553",1000000,"MIL-STD-1553",1000000,"MIL-STD-1553",1000000,"MIL-STD-1553",1000000,"MIL-STD-1553",1000000,"MIL-STD-1553",1000000,"MIL-STD-1553",1000000,"MIL-STD-1553",1000000,"MIL-STD-1553",1000000,"MIL-STD-1553",1000000,"MIL-STD-1553",1000000,"MIL-STD-1553",1000000,"MIL-STD-1553",1000000,"MIL-STD-1553",1000000,"MIL-STD-1553",1000000,"MIL-STD-1553",1000000,"MIL-STD-1553",1000000,"MIL-STD-1553",1000000,"MIL-STD-1553",1000000,"MIL-STD-1553",1000000,"MIL-STD-1553",1000000,"MIL-STD-1553",1000000,"MIL-STD-1553",1000000,"MIL-STD-1553",1000000,"MIL-STD-1553",1000000,"MIL-STD-1553",1000000,"MIL-STD-1553",1000000,"MIL-STD-1553",1000000,"MIL-STD-1553",1000000,"MIL-STD-1553",1000000,"MIL-STD-1553",1000000,"MIL-STD-1553",1000000,"MIL-STD-1553",1000000,"MIL-STD-1553",1000000,"MIL-STD-1553",1000000,"MIL-STD-1553",1000000,"MIL-STD-1553",1000000,"MIL-STD-1553",1000000,"MIL-STD-1553",1000000,"MIL-STD-1553",1000000,"MIL-STD-1553",1000000,"MIL-STD-1553",1000000,"MIL-STD-1553",1000000,"MIL-STD-1553",1000000,"MIL-STD-1553",1000000,"MIL-STD-1553",1000000,"MIL-STD-1553",1000000,"MIL-STD-1553",1000000,"MIL-STD-1553",1000000,"MIL-STD-1553",1000000,"MIL-STD-1553",1000000,"MIL-STD-1553",1000000,"MIL-STD-1553",1000000,"MIL-STD-1553",1000000,"MIL-STD-1553",1000000,"MIL-STD-1553",1000000,"MIL-STD-1553",1000000,"MIL-STD-1553",1000000,"MIL-STD-1553",1000000,"MIL-STD-1553",1000000,"MIL-STD-1553",1000000,"MIL-STD-1553",1000000,"MIL-STD-1553",1000000,"MIL-STD-1553",1000000,"MIL-STD-1553",1000000,"MIL-STD-1553",1000000,"MIL-STD-1553",1000000,"MIL-STD-1553",1000000,"MIL-STD-1553",1000000,"MIL-STD-1553",1000000,"MIL-STD-1553",1000000,"MIL-STD-1553",1000000,"MIL-STD-1553",1000000,"MIL-STD-1553",1000000,"MIL-STD-1553",1000000,"MIL-STD-1553",1000000,"MIL-STD-1553",1000000,"MIL-STD-1553",1000000,"MIL-STD-1553",1000000,"MIL-STD-1553",1000000,"MIL-STD-1553",1000000,"MIL-STD-1553",1000000,"MIL-STD-1553",1000000,"MIL-STD-1553",1000000,"MIL-STD-1553",1000000,"MIL-STD-1553",1000000,"MIL-STD-1553",1000000,"MIL-STD-1553",1000000,"MIL-STD-1553",1000000,"MIL-STD-1553",1000000,"MIL-STD-1553",1000000,"MIL-STD-1553",1000000,"MIL-STD-1553",1000000,"MIL-STD-1553",1000000,"MIL-STD-1553",1000000,"MIL-STD-1553",1000000,"MIL-STD-1553",1000000,"MIL-STD-1553",1000000,"MIL-STD-1553",1000000,"MIL-STD-1553",1000000,"MIL-STD-1553",1000000,"MIL-STD-1553",1000000,"MIL-STD-1553",1000000,"MIL-STD-1553",1000000,"MIL-STD-1553",1000000,"MIL-STD-1553",1000000,"MIL-STD-1553",1000000,"MIL-STD-1553",1000000,"MIL-STD-1553",1000000,"MIL-STD-1553",1000000,"MIL-STD-1553",1000000,"MIL-STD-1553",1000000,"MIL-STD-1553",1000000,"MIL-STD-1553",1000000,"MIL-STD-1553",1000000,"MIL-STD-1553",1000000,"MIL-STD-1553",1000000,"MIL-STD-1553",1000000,"MIL-STD-1553",1000000,"MIL-STD-1553",1000000,"MIL-STD-1553",1000000,"MIL-STD-1553",1000000,"MIL-STD-1553",1000000,"MIL-STD-1553",1000000,"MIL-STD-1553",1000000,"MIL-STD-1553",1000000,"MIL-STD-1553",1000000,"MIL-STD-1553",1000000,"MIL-STD-1553",1000000,"MIL-STD-1553",1000000,"MIL-STD-1553",1000000,"MIL-STD-1553",1000000,"MIL-STD-1553",1000000,"MIL-STD-1553",1000000,"MIL-STD-1553",1000000,"MIL-STD-1553",1000000,"MIL-STD-1553",1000000,"MIL-STD-1553",1000000,"MIL-STD-1553",1000000,"MIL-STD-1553",1000000,"MIL-STD-1553",1000000,"MIL-STD-1553",1000000,"MIL-STD-1553",1000000,"MIL-STD-1553",1000000,"MIL-STD-1553",1000000,"MIL-STD-1553",1000000,"MIL-STD-1553",1000000,"MIL-STD-1553",1000000,"MIL-STD-1553",1000000,"MIL-STD-1553",1000000,"MIL-STD-1553",1000000,"MIL-STD-1553",1000000,"MIL-STD-1553",1000000,"MIL-STD-1553",1000000,"MIL-STD-1553",1000000,"MIL-STD-1553",1000000,"MIL-STD-1553",1000000,"MIL-STD-1553",1000000,"MIL-STD-1553",1000000,"MIL-STD-1553",1000000,"MIL-STD-1553",1000000,"MIL-STD-1553",1000000,"MIL-STD-1553",1000000,"MIL-STD-1553",1000000,"MIL-STD-1553",1000000,"MIL-STD-1553",1000000,"MIL-STD-1553",1000000,"MIL-STD-1553",1000000,"MIL-STD-1553",1000000,"MIL-STD-1553",1000000,"MIL-STD-1553",1000000,"MIL-STD-1553",1000000,"MIL-STD-1553",1000000,"MIL-STD-1553",1000000,"MIL-STD-1553",1000000,"MIL-STD-1553",1000000,"MIL-STD-1553",1000000,"MIL-STD-1553",1000000,"MIL-STD-1553",1000000,"MIL-STD-1553",1000000,"MIL-STD-1553",1000000,"MIL-STD-1553",1000000,"MIL-STD-1553",1000000,"MIL-STD-1553",1000000,"MIL-STD-1553",1000000,"MIL-STD-1553",1000000,"MIL-STD-1553",1000000,"MIL-STD-1553",1000000,"MIL-STD-1553",1000000,"MIL-STD-1553",1000000,"MIL-STD-1553",1000000,"MIL-STD-1553",1000000,"MIL-STD-1553",1000000,"MIL-STD-1553",1000000,"MIL-STD-1553",1000000,"MIL-STD-1553",1000000,"MIL-STD-1553",1000000,"MIL-STD-1553",1000000,"MIL-STD-1553",1000000,"MIL-STD-1553",1000000,"MIL-STD-1553",1000000,"MIL-STD-1553",1000000,"MIL-STD-1553",1000000,"MIL-STD-1553",1000000,"MIL-STD-1553",1000000,"MIL-STD-1553",1000000,"MIL-STD-1553",1000000,"MIL-STD-1553",1000000,"MIL-STD-1553",1000000,"MIL-STD-1553",1000000,"MIL-STD-1553",1000000,"MIL-STD-1553",1000000,"MIL-STD-1553",1000000,"MIL-STD-1553",1000000,"MIL-STD-1553",1000000,"MIL-STD-1553",1000000,"MIL-STD-1553",1000000,"MIL-STD-1553",1000000,"MIL-STD-1553",1000000,"MIL-STD-1553",1000000,"MIL-STD-1553",1000000,"MIL-STD-1553",1000000,"MIL-STD-1553",1000000,"MIL-STD-1553",1000000,"MIL-STD-1553",1000000,"MIL-STD-1553",1000000,"MIL-STD-1553",1000000,"MIL-STD-1553",1000000,"MIL-STD-1553",1000000,"MIL-STD-1553",1000000,"MIL-STD-1553",1000000]
["MIL-STD-1553",1000000,"bit/s"]
["I2C",400000,"bit/s"]
["SpireWire",400000000]
["CAN",5000000]
["Time Triggered ( Ethernet)",10000000000]

{"sheet":"ProductTreeMain","index":10,"n_rows":3,"n_cols":1,"rows_kept":3,"cut":false,"hidden":false,"merged":[]}
[1]
[1]
[1]

{"sheet":"Trade_off","index":11,"n_rows":52,"n_cols":20,"rows_kept":52,"cut":false,"hidden":false,"merged":[[29,0,30,0],[29,1,30,1],[29,17,30,17],[31,0,40,0]]}
[null,"Trade-off table",null,null,null,null,null,null,null,null,null,null,null,null,null,null,null,null,null,"Version 1.4"]
[null,"1. Fill in the names of the trade-off parameters in the green priority list. Leave empty if no parameter",null,null,null,null,null,null,null,null,null,null,null,null,null,null,null,">",null,"R. Biesbroek"]
[null,"2. Rank the parameters in order of priority and indicate if a parameter is more important (>) or equally important (=) than the next one. ",null,null,null,null,null,null,null,null,null,null,null,null,null,null,null,"=",null,"TEC-SYE"]
[null,"This will automatically create the weight factor definition table.  (replace them if you do not agree with the outcome)",null,null,null,null,null,null,null,null,null,null,null,null,null,null,null,null,null,"Loris Franchi"]
[null,"3. Define the options e.g. replace 'text 1' by 'chemical propulsion platform'",null,null,null,null,null,null,null,null,null,null,null,null,null,null,null,null,null,"Politecnico di Torino"]
[null,"4. Fill in the trade-off table by assigning a score to each option for each key trade-off parameter. Use the same scale, e.g. 1 to 5"]
[null,"5. The bottom row will give the ranking of the options, taking into account the weight factors"]
[null,"Please fill in only the GREEN parts in the tables!"]
[]
[null,"Please insert trade-off parameter names  in the green list and select condition ('>' or '=')from the drop-down menu's: (order in terms of decreasing importance)"]
[null,"Parameter1",null,"parameter2",null,"parameter3",null,"parameter4",null,"parameter5",null,"parameter6",null,"parameter7",null,"parameter8",null,"parameter9",null,"parameter10"]
["Priority List","Mass",">","Cost",">","Power","=","Equilibrium temperature","=","E","=",null,"=",null,"=",null,"=",null,"="]
["Value:",null,{"$f":"IF(C12=\">\",1,0)","v":1},null,{"$f":"IF(E12=\">\",1,0)","v":1},null,{"$f":"IF(G12=\">\",1,0)","v":0},null,{"$f":"IF(I12=\">\",1,0)","v":0},null,{"$f":"IF(K12=\">\",1,0)","v":0},null,{"$f":"IF(M12=\">\",1,0)","v":0},null,{"$f":"IF(O12=\">\",1,0)","v":0},null,{"$f":"IF(Q12=\">\",1,0)","v":0},null,{"$f":"IF(S12=\">\",1,0)","v":0}]
[]
["Key trade-off parameters & weight factor definition. This table is automatically produced and requires no inputs"]
["Weight factor\ndefinition\ntable","Key trade-off Parameter",{"$f":"B17","v":"Mass"},{"$f":"B18","v":"Cost"},{"$f":"B19","v":"Power"},{"$f":"B20","v":"Equilibrium temperature"},{"$f":"B21","v":"E"},{"$f":"B22","v":""},{"$f":"B23","v":""},{"$f":"B24","v":""},{"$f":"B25","v":""},{"$f":"B26","v":""},"Total score","Scaled score\n(>=1)",null,"Weight factor \n(0..1)"]
[1,{"$f":"IF(B12=\"\",\"\",B12)","v":"Mass"},null,{"$f":"IF(D16=\"\",0,C13)","v":1},{"$f":"IF(E$16=\"\",0,MAX(D17,E$13))","v":1},{"$f":"IF(F$16=\"\",0,MAX(E17,G$13))","v":1},{"$f":"IF(F$16=\"\",0,MAX(F17,I$13))","v":1},{"$f":"IF(H$16=\"\",0,MAX(G17,K$13))","v":0},{"$f":"IF(I$16=\"\",0,MAX(H17,M$13))","v":0},{"$f":"IF(J$16=\"\",0,MAX(I17,O$13))","v":0},{"$f":"IF(K$16=\"\",0,MAX(J17,Q$13))","v":0},{"$f":"IF(L$16=\"\",0,MAX(K17,S$13))","v":0},{"$f":"IF(B17=\"\",\"\",SUM(C17:L17))","v":4},{"$f":"IF(B17=\"\",\"\",M17+ABS(MIN($M$17:$M$26))+1)","v":7},null,{"$f":"IF(B17=\"\",\"\",N17/SUM($N$17:$N$26))","v":0.46666666666666667}]
[2,{"$f":"IF(D12=\"\",\"\",D12)","v":"Cost"},{"$f":"-D17","v":-1},null,{"$f":"IF(E$16=\"\",0,MAX(D18,E$13))","v":1},{"$f":"IF(F$16=\"\",0,MAX(E18,G$13))","v":1},{"$f":"IF(F$16=\"\",0,MAX(F18,I$13))","v":1},{"$f":"IF(H$16=\"\",0,MAX(G18,K$13))","v":0},{"$f":"IF(I$16=\"\",0,MAX(H18,M$13))","v":0},{"$f":"IF(J$16=\"\",0,MAX(I18,O$13))","v":0},{"$f":"IF(K$16=\"\",0,MAX(J18,Q$13))","v":0},{"$f":"IF(L$16=\"\",0,MAX(K18,S$13))","v":0},{"$f":"IF(B18=\"\",\"\",SUM(C18:L18))","v":2},{"$f":"IF(B18=\"\",\"\",M18+ABS(MIN($M$17:$M$26))+1)","v":5},null,{"$f":"IF(B18=\"\",\"\",N18/SUM($N$17:$N$26))","v":0.33333333333333331}]
[3,{"$f":"IF(F12=\"\",\"\",F12)","v":"Power"},{"$f":"-E17","v":-1},{"$f":"-E18","v":-1},null,0,0,0,0,0,0,0,-2,1,null,6.6666666666666666E-2]
[4,{"$f":"IF(H12=\"\",\"\",H12)","v":"Equilibrium temperature"},{"$f":"-F17","v":-1},{"$f":"-F18","v":-1},{"$f":"-F19","v":0},null,0,0,0,0,0,0,-2,1,null,6.6666666666666666E-2]
[5,{"$f":"IF(J12=\"\",\"\",J12)","v":"E"},{"$f":"-G17","v":-1},{"$f":"-G18","v":-1},{"$f":"-G19","v":0},{"$f":"-G20","v":0},null,0,0,0,0,0,-2,1,null,6.6666666666666666E-2]
[6,{"$f":"IF(L12=\"\",\"\",L12)","v":""},{"$f":"-H17","v":0},{"$f":"-H18","v":0},{"$f":"-H19","v":0},{"$f":"-H20","v":0},{"$f":"-H21","v":0},null,0,0,0,0,"",{"$f":"IF(B22=\"\",\"\",M22+ABS(MIN($M$17:$M$26))+1)","v":""},null,""]
[7,{"$f":"IF(N12=\"\",\"\",N12)","v":""},{"$f":"-I17","v":0},{"$f":"-I18","v":0},{"$f":"-I19","v":0},{"$f":"-I20","v":0},{"$f":"-I21","v":0},{"$f":"-I22","v":0},null,0,0,0,"","",null,""]
[8,{"$f":"IF(P12=\"\",\"\",P12)","v":""},{"$f":"-J17","v":0},{"$f":"-J18","v":0},{"$f":"-J19","v":0},{"$f":"-J20","v":0},{"$f":"-J21","v":0},{"$f":"-J22","v":0},{"$f":"-J23","v":0},null,0,0,"","",null,""]
[9,{"$f":"IF(R12=\"\",\"\",R12)","v":""},{"$f":"-K17","v":0},{"$f":"-K18","v":0},{"$f":"-K19","v":0},{"$f":"-K20","v":0},{"$f":"-K21","v":0},{"$f":"-K22","v":0},{"$f":"-K23","v":0},{"$f":"-K24","v":0},null,0,"","",null,""]
[10,{"$f":"IF(T12=\"\",\"\",T12)","v":""},{"$f":"-L17","v":0},{"$f":"-L18","v":0},{"$f":"-L19","v":0},{"$f":"-L20","v":0},{"$f":"-L21","v":0},{"$f":"-L22","v":0},{"$f":"-L23","v":0},{"$f":"-L24","v":0},{"$f":"-L25","v":0},null,"","",null,""]
[]
[]
["Trade-off table. Please define the option names, and fill in the score for each option, for each parameter. The bottom row will show the ranking"]
["Trade-off table","Options\ndefinition:","Option 1","Option 2","Option 3","Option 4","Option 5","Option 6","Option 7","Option 8","Option 9","Option 10","Option 11","Option 12","Option 13","Option 14","Option 15","Weight\nFactor\n(1..10)"]
[null,null,"text 1","text 2","text 3","text 4","text 5","text 6","text 7","text 8","text 9","text 10","text 11","text 12","text 13","text 14","text 15"]
["Key trade-off Parameter",{"$f":"B17","v":"Mass"},3,3,3,null,null,null,null,null,null,null,null,null,null,null,null,{"$f":"IF(B17=\"\",0,P17)","v":0.46666666666666667}]
[null,{"$f":"B18","v":"Cost"},5,7,4,null,null,null,null,null,null,null,null,null,null,null,null,{"$f":"IF(B18=\"\",0,P18)","v":0.33333333333333331}]
[null,"Power",8,5,2,null,null,null,null,null,null,null,null,null,null,null,null,6.6666666666666666E-2]
[null,"Equilibrium temperature",4,3,1,null,null,null,null,null,null,null,null,null,null,null,null,6.6666666666666666E-2]
[null,"E",null,null,null,null,null,null,null,null,null,null,null,null,null,null,null,6.6666666666666666E-2]
[null,"",null,null,null,null,null,null,null,null,null,null,null,null,null,null,null,0]
[null,"",null,null,null,null,null,null,null,null,null,null,null,null,null,null,null,0]
[null,"",null,null,null,null,null,null,null,null,null,null,null,null,null,null,null,0]
[null,"",null,null,null,null,null,null,null,null,null,null,null,null,null,null,null,0]
[null,"",null,null,null,null,null,null,null,null,null,null,null,null,null,null,null,0]
[null,"Total score",{"$f":"C32*$R32+C33*$R33+C34*$R34+C35*$R35+C36*$R36+C37*$R37+C38*$R38+C39*$R39+C40*$R40+C41*$R41","v":3.8666666666666663},{"$f":"D32*$R32+D33*$R33+D34*$R34+D35*$R35+D36*$R36+D37*$R37+D38*$R38+D39*$R39+D40*$R40+D41*$R41","v":4.2666666666666666},2.9333333333333336,0,0,0,0,0,0,0,0,0,0,0,0]
[null,"Ranking",{"$f":"RANK(C42,$C42:$Q42)","v":2},{"$f":"RANK(D42,$C42:$Q42)","v":1},3,4,4,4,4,4,4,4,4,4,4,4,4]
[]
[]
[null,null,null,null,null,null,null,null,null,null,null,null,null,null,null,null,null,null,null,"Add options and parameters to Radar Chart:"]
[null,null,null,null,null,null,null,null,null,null,null,null,null,null,null,null,null,null,null,"1. Right click on the radar chart"]
[null,null,null,null,null,null,null,null,null,null,null,null,null,null,null,null,null,null,null,"2. Click on select data "]
[null,null,null,null,null,null,null,null,null,null,null,null,null,null,null,null,null,null,null,"3. In horizontal axes label select or unselect the parameters that will be displayed"]
[null,null,null,null,null,null,null,null,null,null,null,null,null,null,null,null,null,null,null,"4. in legend entries click add "]
[null,null,null,null,null,null,null,null,null,null,null,null,null,null,null,null,null,null,null,"5. Select option name ( row 30 column x ) as series name"]
[null,null,null,null,null,null,null,null,null,null,null,null,null,null,null,null,null,null,null,"6. select the value of each parameter related to the option for values"]

{"sheet":"Constants","index":12,"n_rows":174,"n_cols":44,"rows_kept":174,"cut":false,"hidden":false,"merged":[[28,4,28,6],[37,4,37,5],[50,4,50,5]]}
["Speed of Light",{"$f":"299792458","v":299792458},"m/s",null,"For constants please refere to Space mission analysis and design third edition"]
["Planck's Constant",{"$f":"6.6260755E-34","v":6.6260755E-34},"W-s^2"]
["Boltzmann's Constant",{"$f":"1.380658E-23","v":1.3806580000000001E-23},"W-s/K",null,"Drag Table",null,"Density",null,null," ","Curve Fit Coefficients"]
["Stefan-Boltzmann Constant",{"$f":"0.0000000567051","v":5.6705100000000003E-8},"W/m^2/K^4",null,"Altitude","Scale Height","Min","Mean","Max",null,"Scale Height",null,"Min",null,"Mean",null,"Max"]
[null,null,null,null,0,8.4,{"$f":"$B$33*1.2*10^0","v":1.2},{"$f":"1.2*10^0*$B$33","v":1.2},{"$f":"1.2*10^0*$B$33","v":1.2},null,{"$f":"LOGEST(F5:F6,E5:E6)","v":0.99647343942365929},8.4,{"$f":"LOGEST(G5:G6,E5:E6)","v":0.86267099598919128},1.2000000000000013,{"$f":"LOGEST(H5:H6,E5:E6)","v":0.86300148430553925},1.2000000000000004,{"$f":"LOGEST(I5:I6,E5:E6)","v":0.86354284336938314},1.2000000000000024]
[null,null,null,null,100,5.9,{"$f":"4.61*10^-7*$B$33","v":4.6100000000000001E-7},{"$f":"4.79*10^-7*$B$33","v":4.7899999999999999E-7},{"$f":"5.1*10^-7*$B$33","v":5.0999999999999999E-7},null,{"$f":"LOGEST(F6:F7,E6:E7)","v":1.0297072329929207},0.31584621299500232,{"$f":"LOGEST(G6:G7,E6:E7)","v":0.89346112401831479},3.5986108723599558E-2,{"$f":"LOGEST(H6:H7,E6:E7)","v":0.89443103759468146},3.3546667989377735E-2,{"$f":"LOGEST(I6:I7,E6:E7)","v":0.89544970934785129},3.1875000000000216E-2]
["Sun - Gravitational Constant",132700000000,"km^3/sec^2",null,150,25.5,{"$f":"1.65*10^-9*$B$33","v":1.6500000000000001E-9},{"$f":"1.81*10^-9*$B$33","v":1.8100000000000002E-9},{"$f":"2.04*10^-9*$B$33","v":2.04E-9},null,{"$f":"LOGEST(F7:F8,E7:E8)","v":1.0077430733560648},8.018015999999994,{"$f":"LOGEST(G7:G8,E7:E8)","v":0.95644218110239376},1.3142432947406164E-6,{"$f":"LOGEST(H7:H8,E7:E8)","v":0.96141045125510749},6.627545774349797E-7,{"$f":"LOGEST(I7:I8,E7:E8)","v":0.96546881378077976},3.9709340956047757E-7]
[null,null,null,null,200,37.5,{"$f":"1.78*10^-10*$B$33","v":1.7800000000000001E-10},{"$f":"2.53*10^-10*$B$33","v":2.5300000000000001E-10},{"$f":"3.52*10^-10*$B$33","v":3.5200000000000003E-10},null,{"$f":"LOGEST(F8:F9,E8:E9)","v":1.0035636789870466},18.409597045466189,{"$f":"LOGEST(G8:G9,E8:E9)","v":0.96714701577121509},1.4187987049891646E-7,{"$f":"LOGEST(H8:H9,E8:E9)","v":0.97239178546508487},6.836979018839576E-8,{"$f":"LOGEST(I8:I9,E8:E9)","v":0.97628195923691496},4.2804542175819242E-8]
["Radius of Earth Orbit around the Sun",149600000,"km",null,250,44.8,{"$f":"3.35*10^-11*$B$33","v":3.3500000000000001E-11},{"$f":"6.24*10^-11*$B$33","v":6.2399999999999999E-11},{"$f":"1.06*10^-10*$B$33","v":1.0600000000000001E-10},null,{"$f":"LOGEST(F9:F10,E9:E10)","v":1.0023186226113339},25.108927269167818,{"$f":"LOGEST(G9:G10,E9:E10)","v":0.97222051708922141},3.8357415185596573E-8,{"$f":"LOGEST(H9:H10,E9:E10)","v":0.97700548171152435},2.0937965568000135E-8,{"$f":"LOGEST(I9:I10,E9:E10)","v":0.98050042536913595},1.456663579927229E-8]
["Earth - Orbital Period",365.25400000000002,"days",null,300,50.3,{"$f":"8.19*10^-12*$B$33","v":8.1899999999999996E-12},{"$f":"1.95*10^-11*$B$33","v":1.9499999999999997E-11},{"$f":"3.96*10^-11*$B$33","v":3.9599999999999998E-11},null,{"$f":"LOGEST(F10:F11,E10:E11)","v":1.0017151715639681},30.08101903544739,{"$f":"LOGEST(G10:G11,E10:E11)","v":0.97525601850620436},1.5055395468750046E-8,{"$f":"LOGEST(H10:H11,E10:E11)","v":0.97966234659641926},9.2706405771136565E-9,{"$f":"LOGEST(I10:I11,E10:E11)","v":0.98285628058069752},7.0907148974368284E-9]
["Earth - Radius",6378.1369999999997,"km",null,350,54.8,{"$f":"2.34*10^-12*$B$33","v":2.3399999999999997E-12},{"$f":"6.98*10^-12*$B$33","v":6.9800000000000006E-12},{"$f":"1.668*10^-11*$B$33","v":1.6679999999999998E-11},null,{"$f":"LOGEST(F11:F12,E11:E12)","v":1.0012046281980518},35.957010369125094,{"$f":"LOGEST(G11:G12,E11:E12)","v":0.97702551278446703},7.9826905087363789E-9,{"$f":"LOGEST(H11:H12,E11:E12)","v":0.98132817847367793},5.1151815532580723E-9,{"$f":"LOGEST(I11:I12,E11:E12)","v":0.98427174476845669},4.2848903122017038E-9]
["Earth - Gravitational Constant",398600.44179999997,"km^3/sec^2",null,400,58.2,{"$f":"0.000000000000732*$B$33","v":7.3200000000000001E-13},{"$f":"0.00000000000272*$B$33","v":2.7200000000000001E-12},{"$f":"0.00000000000755*$B$33","v":7.5500000000000007E-12},null,{"$f":"LOGEST(F12:F13,E12:E13)","v":1.0010384285580636},38.425813069096527,{"$f":"LOGEST(G12:G13,E12:E13)","v":0.97850650567608033},4.3553604537007836E-9,{"$f":"LOGEST(H12:H13,E12:E13)","v":0.98258513759556954},3.0654383649850907E-9,{"$f":"LOGEST(I12:I13,E12:E13)","v":0.98535155208239156},2.7635348737019309E-9]
["Earth - Sidereal Day",{"$f":"23+56/60+4/3600","v":23.934444444444445},"hours",null,450,61.3,{"$f":"0.000000000000247*$B$33","v":2.4700000000000001E-13},{"$f":"0.00000000000113*$B$33","v":1.13E-12},{"$f":"0.00000000000361*$B$33","v":3.6100000000000002E-12},null,{"$f":"LOGEST(F13:F14,E13:E14)","v":1.0010182256573112},38.776384530432807,{"$f":"LOGEST(G13:G14,E13:E14)","v":0.97996730783460739},2.2257813678725773E-9,{"$f":"LOGEST(H13:H14,E13:E14)","v":0.98338732952300345},2.1232674535004475E-9,{"$f":"LOGEST(I13:I14,E13:E14)","v":0.98617799126284589},1.8950447638629697E-9]
["Earth - Solar Day",24,"hours",null,500,64.5,{"$f":"0.0000000000000898*$B$33","v":8.9800000000000006E-14},{"$f":"0.000000000000489*$B$33","v":4.8900000000000004E-13},{"$f":"0.0000000000018*$B$33","v":1.8E-12},null,{"$f":"LOGEST(F14:F15,E14:E15)","v":1.0012624757609592},34.323335891636866,{"$f":"LOGEST(G14:G15,E14:E15)","v":0.98204775184085935},7.7085634766226934E-10,{"$f":"LOGEST(H14:H15,E14:E15)","v":0.98424148961990421},1.3755447178182631E-9,{"$f":"LOGEST(I14:I15,E14:E15)","v":0.98677328788241292},1.4014584573745438E-9]
[null,null,null,null,550,68.7,{"$f":"0.0000000000000363*$B$33","v":3.6300000000000001E-14},{"$f":"0.000000000000221*$B$33","v":2.2099999999999999E-13},{"$f":"0.000000000000925*$B$33","v":9.25E-13},null,{"$f":"LOGEST(F15:F16,E15:E16)","v":1.0017028218724708},26.950279165713035,{"$f":"LOGEST(G15:G16,E15:E16)","v":0.98470933069819921},1.7397121696089749E-10,{"$f":"LOGEST(H15:H16,E15:E16)","v":0.98503762945483397},8.8174001825821176E-10,{"$f":"LOGEST(I15:I16,E15:E16)","v":0.98733229452271587},1.0263685655874676E-9]
["Radius of Planet Orbit around the Sun",149600000,"km",null,600,74.8,{"$f":"0.0000000000000168*$B$33","v":1.6799999999999998E-14},{"$f":"0.000000000000104*$B$33","v":1.04E-13},{"$f":"0.000000000000489*$B$33","v":4.8900000000000004E-13},null,{"$f":"LOGEST(F16:F17,E16:E17)","v":1.0024179087704428},17.563514060429057,{"$f":"LOGEST(G16:G17,E16:E17)","v":0.98789943779896028},2.4984249810371628E-11,{"$f":"LOGEST(H16:H17,E16:E17)","v":0.98604214505505416},4.783509737758123E-10,{"$f":"LOGEST(I16:I17,E16:E17)","v":0.98774741403839106},7.975685973417382E-10]
["Planet - Orbital Period",365.25400000000002,"days",null,650,84.4,{"$f":"0.00000000000000914*$B$33","v":9.1399999999999994E-15},{"$f":"0.0000000000000515*$B$33","v":5.1500000000000001E-14},{"$f":"0.000000000000264*$B$33","v":2.6399999999999999E-13},null,{"$f":"LOGEST(F17:F18,E17:E18)","v":1.0032568554554959},10.196568057906818,{"$f":"LOGEST(G17:G18,E17:E18)","v":0.99073912500205386},3.8671599834519859E-12,{"$f":"LOGEST(H17:H18,E17:E18)","v":0.98731385949615302},2.0696907282656924E-10,{"$f":"LOGEST(I17:I18,E17:E18)","v":0.98835796872936854},5.3373984411506108E-10]
["Planet - Radius",6378.1369999999997,"km",null,700,99.3,{"$f":"0.00000000000000574*$B$33","v":5.7400000000000002E-15},{"$f":"0.0000000000000272*$B$33","v":2.72E-14},{"$f":"0.000000000000147*$B$33","v":1.47E-13},null,{"$f":"LOGEST(F18:F19,E18:E19)","v":1.0039607225025682},6.2408471064885678,{"$f":"LOGEST(G18:G19,E18:E19)","v":0.99275302727877701},9.33378614960351E-13,{"$f":"LOGEST(H18:H19,E18:E19)","v":0.98881547809545578},7.1431502647818523E-11,{"$f":"LOGEST(I18:I19,E18:E19)","v":0.98879932770823109},3.9048432895712179E-10]
["Planet - Gravitational Constant",398600.44179999997,"km^3/sec^2",null,750,121,{"$f":"0.00000000000000399*$B$33","v":3.9899999999999998E-15},{"$f":"0.0000000000000155*$B$33","v":1.55E-14},{"$f":"0.0000000000000837*$B$33","v":8.3699999999999999E-14},null,{"$f":"LOGEST(F19:F20,E19:E20)","v":1.0044396118292633},4.3642710536346394,{"$f":"LOGEST(G19:G20,E19:E20)","v":0.99404575792898242},3.5171481740108943E-13,{"$f":"LOGEST(H19:H20,E19:E20)","v":0.99052602759281694},1.9539473795978207E-11,{"$f":"LOGEST(I19:I20,E19:E20)","v":0.98717643846556513},1.3385651822102685E-9]
["Planet - J2",1.08263E-3,null,null,800,151,{"$f":"0.00000000000000296*$B$33","v":2.96E-15},{"$f":"0.00000000000000963*$B$33","v":9.6300000000000007E-15},{"$f":"0.0000000000000439*$B$33","v":4.3900000000000001E-14},null,{"$f":"LOGEST(F20:F21,E20:E21)","v":1.0043928629789283},4.5298363842453391,{"$f":"LOGEST(G20:G21,E20:E21)","v":0.99479332545704979},1.9275317303929872E-13,{"$f":"LOGEST(H20:H21,E20:E21)","v":0.99207740813652334},5.5869963858069021E-12,{"$f":"LOGEST(I20:I21,E20:E21)","v":0.99241457687135637},1.9406926837156084E-11]
["Planet - Moon Node Precession Coefficient",-3.3800000000000002E-3,null,null,850,188,{"$f":"0.00000000000000228*$B$33","v":2.28E-15},{"$f":"0.00000000000000647*$B$33","v":6.4699999999999998E-15},{"$f":"0.00000000000003*$B$33","v":2.9999999999999998E-14},null,{"$f":"LOGEST(F21:F22,E21:E22)","v":1.0036886471043338},8.2223852494748488,{"$f":"LOGEST(G21:G22,E21:E22)","v":0.99528338277796058},1.2682201794880647E-13,{"$f":"LOGEST(H21:H22,E21:E22)","v":0.99345827763426942},1.7128387056351139E-12,{"$f":"LOGEST(I21:I22,E21:E22)","v":0.99101046870177212},6.4656968987765573E-11]
["Planet - Sun Node Precession Coefficient",-1.5399999999999999E-3,null,null,900,226,{"$f":"0.0000000000000018*$B$33","v":1.8000000000000001E-15},{"$f":"0.00000000000000466*$B$33","v":4.66E-15},{"$f":"0.0000000000000191*$B$33","v":1.9099999999999999E-14},null,{"$f":"LOGEST(F22:F23,E22:E23)","v":1.003036982975154},14.75220269622452,{"$f":"LOGEST(G22:G23,E22:E23)","v":0.9955470727844663},9.9920072216262486E-14,{"$f":"LOGEST(H22:H23,E22:E23)","v":0.99451731068445393},6.5655891186421452E-13,{"$f":"LOGEST(I22:I23,E22:E23)","v":0.9918714896313483},2.9591501382697513E-11]
["Planet - Moon Perigee Rotation Coefficient",1.6900000000000001E-3,null,null,950,263,{"$f":"0.00000000000000144*$B$33","v":1.4399999999999999E-15},{"$f":"0.00000000000000354*$B$33","v":3.5399999999999999E-15},{"$f":"0.0000000000000127*$B$33","v":1.27E-14},null,{"$f":"LOGEST(F23:F24,E23:E24)","v":1.0023669051507635},27.833797269029549,{"$f":"LOGEST(G23:G24,E23:E24)","v":0.99585582360173075},7.442493580643573E-14,{"$f":"LOGEST(H23:H24,E23:E24)","v":0.99524961630677777},3.2627618699970499E-13,{"$f":"LOGEST(I23:I24,E23:E24)","v":0.99277988881129975},1.2401704637977268E-11]
["Planet - Sun Perigee Rotation Coefficient",7.6999999999999996E-4,null,null,1000,296,{"$f":"0.00000000000000117*$B$33","v":1.1700000000000001E-15},{"$f":"0.00000000000000279*$B$33","v":2.79E-15},{"$f":"0.00000000000000884*$B$33","v":8.8400000000000001E-15},null,{"$f":"LOGEST(F24:F25,E24:E25)","v":1.0012844550870601},82.000764796197444,{"$f":"LOGEST(G24:G25,E24:E25)","v":0.99633302076948493},4.609584562287006E-14,{"$f":"LOGEST(H24:H25,E24:E25)","v":0.99632006130950868},1.1135996896211084E-13,{"$f":"LOGEST(I24:I25,E24:E25)","v":0.99510152086947978},1.1996712985778447E-12]
["Planet - Sidereal Day",{"$f":"23+56/60+4/3600","v":23.934444444444445},"hours",null,1250,408,{"$f":"0.000000000000000467*$B$33","v":4.67E-16},{"$f":"0.00000000000000111*$B$33","v":1.1100000000000001E-15},{"$f":"0.00000000000000259*$B$33","v":2.5899999999999999E-15},null,{"$f":"LOGEST(F25:F26,E25:E26)","v":1.0009397996995577},126.09924038172402,{"$f":"LOGEST(G25:G26,E25:E26)","v":0.99717100936206238},1.6116179776371475E-14,{"$f":"LOGEST(H25:H26,E25:E26)","v":0.99697911108488935},4.8724709243963904E-14,{"$f":"LOGEST(I25:I26,E25:E26)","v":0.99699330113208129},1.1168617847923854E-13]
["Planet - Solar Day",{"$f":"24","v":24},"hours",null,1500,516,{"$f":"0.00000000000000023*$B$33","v":2.2999999999999999E-16},{"$f":"0.000000000000000521*$B$33","v":5.2099999999999999E-16},{"$f":"0.00000000000000122*$B$33","v":1.2199999999999999E-15}]
["Planet - Velocity at Equator",{"$f":"2*PI()*Planet_Radius/24/60/60*1000","v":463.8312116386399},"m/s"]
["Planet - Magnetic Moment",7960000000000000,"tesla-m^2"]
["Planet - Maximum IR Emission",258,"W/m^2",null,"Mass Distribution for Selected Spacecraft"]
["Planet - Minimum IR Emission",216,"W/m^2",null,null,"Percentage of",null,null,"Percentage of"]
["Planet - Maximum Solar Flux",1418,"W/m^2",null,null,"S/C dry mass",null,null,"S/C dry mass"]
["Planet - Average Solar Flux",1367,"W/m^2",null,"Payload",0.26700000000000002,null,"TT&C",7.4999999999999997E-2]
["Planet - Percent of Earth's Atmosphere",1,null,null,"Structure",0.217,null,"ADCS",0.08]
[null,null,null,null,"Thermal",3.4000000000000002E-2,null,"Propulsion",3.6999999999999998E-2]
[null,null,null,null,"Power",0.27900000000000003]
["Rain Temperature",290,"K"]
[]
["Conversion from inches to meters",{"$f":"0.3048/12","v":2.5400000000000002E-2},"m",null,"Typical Power Consumption"]
[null,null,null,null,null,"Percent of Operating Power"]
[null,null,null,null,null,"Min","Max"]
[null,null,null,null,"Payload",0.2,0.8]
[null,null,null,null,"Propulsion",0.01,0.05]
[null,null,null,null,"Attitude Control",0.05,0.15]
[null,null,null,null,"Communications",0.04,0.15]
[null,null,null,null,"C&DH",0.04,0.1]
[null,null,null,null,"Thermal",0.01,0.05]
[null,null,null,null,"Power",0.05,0.3]
[null,null,null,null,"Structure",0,0]
[]
[]
[null,null,null,null,"ADCS Sensor Sizing "]
[null,null,null,null,null,null,null,null,null,null,"% between"]
[null,null,null,null,null,"Min Mass","Max Mass","Min Power","Max Power",null,"min & max","Mass (kg)","Power (W)"]
[]
[null,null,null,null,"Earth Sensor",2,3.5,2,10,null,0.5,{"$f":"F55+(G55-F55)*K55","v":2.75},{"$f":"H55+(I55-H55)*K55","v":6}]
[null,null,null,null,"Sun Sensor",0.2,1,0,0.2,null,0.5,{"$f":"F56+(G56-F56)*K56","v":0.60000000000000009},{"$f":"H56+(I56-H56)*K56","v":0.1}]
[null,null,null,null,"Star Sensor",5,50,2,20,null,0.5,{"$f":"F57+(G57-F57)*K57","v":27.5},{"$f":"H57+(I57-H57)*K57","v":11}]
[null,null,null,null,"Magnetometer",0.2,1.5,0.2,1,null,0.5,{"$f":"F58+(G58-F58)*K58","v":0.85000000000000009},{"$f":"H58+(I58-H58)*K58","v":0.60000000000000009}]
[null,null,null,null,"Gyroscope",0.8,3.5,5,20,null,0.5,{"$f":"F59+(G59-F59)*K59","v":2.1500000000000004},{"$f":"H59+(I59-H59)*K59","v":12.5}]
[]
[]
[null,null,null,null,"Communications - Amplifiers  "]
[]
[null,null,null,null,null,"Output","Input","Curve Fit",null,null,"Output",null,"Curve Fit",null,null,null,null,null,null,"Output","Input",null,null,"DT D",null,null,null,"(DT D)^-1",null,null,"DT y",null,"Output",null,null,null,"DT D",null,null,null,"(DT D)^-1",null,null,"DT y"]
[null,null,null,null,null,"Power","Power","Coefficients",null,null,"Power","Mass","Coefficients",null,null,null,null,null,null,"Power","Power",null,null,null,null,null,null,null,null,null,null,null,"Power","Mass"]
[null,null,null,null,"SSPA",0.2,10,{"$f":"INDEX(MMULT(AA66:AC68,AE66:AE68),1,1)","v":1.1829442382747484},null,null,7,1.1000000000000001,{"$f":"INDEX(MMULT(AN66:AP68,AR66:AR68),1,1)","v":0.93286813193897444},null,null,null,null,null,null,{"$f":"LOG(F66)","v":-0.69897000433601875},1,null,{"$f":"4","v":4},{"$f":"W67","v":2.204119982655925},{"$f":"X67","v":4.2812487254895908},null,{"$f":"INDEX(MINVERSE(W66:Y68),1,1)","v":0.51014699027108712},{"$f":"INDEX(MINVERSE(W66:Y68),2)","v":0.11058393226860654},{"$f":"INDEX(MINVERSE(W66:Y68),3)","v":-0.29998916164614614},null,{"$f":"U66+U67+U68+U69","v":6.0492180226701819},null,{"$f":"LOG(K66)","v":0.84509804001425681},4.1392685158225077E-2,null,{"$f":"4","v":4},{"$f":"AJ67","v":5.8662873390841952},{"$f":"AK67","v":9.1869637512785118},null,{"$f":"INDEX(MINVERSE(AJ66:AL68),1,1)","v":72.295517299365471},{"$f":"INDEX(MINVERSE(AJ66:AL68),2)","v":-117.33151108467169},{"$f":"INDEX(MINVERSE(AJ66:AL68),3)","v":43.552831989620259},null,{"$f":"AH66+AH67+AH68+AH69","v":0.95763601562356471}]
[null,null,null,null,null,2,20,{"$f":"INDEX(MMULT(AA66:AC68,AE66:AE68),2,1)","v":0.35039787768968989},null,null,30,1.4,{"$f":"INDEX(MMULT(AN66:AP68,AR66:AR68),2,1)","v":-1.7328494292437142},null,null,null,null,null,null,0.3010299956639812,1.3010299956639813,null,{"$f":"T66+T67+T68+T69","v":2.204119982655925},{"$f":"W68","v":4.2812487254895908},{"$f":"T66^3+T67^3+T68^3+T69^3","v":5.3264007461631149},null,{"$f":"INDEX(MINVERSE(W66:Y68),2,1)","v":0.11058393226860654},{"$f":"INDEX(MINVERSE(W66:Y68),2,2)","v":0.84895110258993822},{"$f":"INDEX(MINVERSE(W66:Y68),2,3)","v":-0.54038575353412144},null,{"$f":"T66*U66+T67*U67+T68*U68+T69*U69","v":4.7856905444280091},null,1.4771212547196624,0.14612803567823801,null,{"$f":"AG66+AG67+AG68+AG69","v":5.8662873390841952},{"$f":"AJ68","v":9.1869637512785118},{"$f":"AG66^3+AG67^3+AG68^3+AG69^3","v":15.011975835868084},null,{"$f":"INDEX(MINVERSE(AJ66:AL68),2,1)","v":-117.33151108467169},{"$f":"INDEX(MINVERSE(AJ66:AL68),2,2)","v":194.56416200674056},{"$f":"INDEX(MINVERSE(AJ66:AL68),2,3)","v":-73.151832757308554},null,{"$f":"AG66*AH66+AG67*AH67+AG68*AH68+AG69*AH69","v":1.6310342093601122}]
[null,null,null,null,null,8,40,{"$f":"INDEX(MMULT(AA66:AC68,AE66:AE68),3,1)","v":0.12732782896484807},null,null,50,1.9,{"$f":"INDEX(MMULT(AN66:AP68,AR66:AR68),3,1)","v":0.80457007944009717},null,null,null,null,null,null,0.90308998699194354,1.6020599913279623,null,{"$f":"T66^2+T67^2+T68^2+T69^2","v":4.2812487254895908},{"$f":"Y67","v":5.3264007461631149},{"$f":"T66^4+T67^4+T68^4+T69^4","v":9.2439356010154867},null,{"$f":"INDEX(MINVERSE(W66:Y68),3,1)","v":-0.29998916164614614},{"$f":"INDEX(MINVERSE(W66:Y68),3,2)","v":-0.54038575353412133},{"$f":"INDEX(MINVERSE(W66:Y68),3,3)","v":0.55848931879525177},null,{"$f":"U66*T66^2+U67*T67^2+U68*T68^2+U69*T69^2","v":8.1078482807875343},null,1.6989700043360187,0.27875360095282892,null,{"$f":"AG66^2+AG67^2+AG68^2+AG69^2","v":9.1869637512785118},{"$f":"AL67","v":15.011975835868084},{"$f":"AG66^4+AG67^4+AG68^4+AG69^4","v":25.192426353383205},null,{"$f":"INDEX(MINVERSE(AJ66:AL68),3,1)","v":43.552831989620259},{"$f":"INDEX(MINVERSE(AJ66:AL68),3,2)","v":-73.151832757308654},{"$f":"INDEX(MINVERSE(AJ66:AL68),3,3)","v":27.747833699795244},null,{"$f":"AH66*AG66^2+AH67*AG67^2+AH68*AG68^2+AH69*AG69^2","v":2.8258044262718891}]
[null,null,null,null,null,50,140,null,null,null,70,3.1,null,null,null,null,null,null,null,1.6989700043360187,2.1461280356782382,null,null,null,null,null,null,null,null,null,null,null,1.8450980400142569,0.49136169383427269]
[]
[null,null,null,null,"TWTA",1,10,{"$f":"INDEX(MMULT(AA71:AC73,AE71:AE73),1,1)","v":1.0018770507054953},null,null,1,2,{"$f":"INDEX(MMULT(AN71:AP73,AR71:AR73),1,1)","v":0.30492967970573259},null,null,null,null,null,null,{"$f":"LOG(F71)","v":0},1,null,{"$f":"4","v":4},{"$f":"W72","v":4.0334237554869503},{"$f":"X72","v":6.1172622037907569},null,{"$f":"INDEX(MINVERSE(W71:Y73),1,1)","v":0.97478186774907949},{"$f":"INDEX(MINVERSE(W71:Y73),2)","v":-1.5401004160574805},{"$f":"INDEX(MINVERSE(W71:Y73),3)","v":0.54154130109257181},null,{"$f":"U71+U72+U73+U74","v":6.0492180226701819},null,{"$f":"LOG(K71)","v":0},0.3010299956639812,null,{"$f":"4","v":4},{"$f":"AJ72","v":3.924279286061882},{"$f":"AK72","v":5.7025851953554998},null,{"$f":"INDEX(MINVERSE(AJ71:AL73),1,1)","v":0.9791790260008465},{"$f":"INDEX(MINVERSE(AJ71:AL73),2)","v":-1.6042833840484394},{"$f":"INDEX(MINVERSE(AJ71:AL73),3)","v":0.59252774544134124},null,{"$f":"AH71+AH72+AH73+AH74","v":2.2253092817258628}]
[null,null,null,null,null,6,20,{"$f":"INDEX(MMULT(AA71:AC73,AE71:AE73),2,1)","v":0.23566263382873132},null,null,6,3,{"$f":"INDEX(MMULT(AN71:AP73,AR71:AR73),2,1)","v":0.13455113460149271},null,null,null,null,null,null,0.77815125038364363,1.3010299956639813,null,{"$f":"T71+T72+T73+T74","v":4.0334237554869503},{"$f":"W73","v":6.1172622037907569},{"$f":"T71^3+T72^3+T73^3+T74^3","v":10.136788666568179},null,{"$f":"INDEX(MINVERSE(W71:Y73),2,1)","v":-1.5401004160574805},{"$f":"INDEX(MINVERSE(W71:Y73),2,2)","v":5.2898664517637126},{"$f":"INDEX(MINVERSE(W71:Y73),2,3)","v":-2.4808273440139752},null,{"$f":"T71*U71+T72*U72+T73*U73+T74*U74","v":7.2907808595053387},null,0.77815125038364363,0.47712125471966244,null,{"$f":"AG71+AG72+AG73+AG74","v":3.924279286061882},{"$f":"AJ73","v":5.7025851953554998},{"$f":"AG71^3+AG72^3+AG73^3+AG74^3","v":8.9548392404746231},null,{"$f":"INDEX(MINVERSE(AJ71:AL73),2,1)","v":-1.6042833840484394},{"$f":"INDEX(MINVERSE(AJ71:AL73),2,2)","v":6.0493649449030098},{"$f":"INDEX(MINVERSE(AJ71:AL73),2,3)","v":-3.0376159965178968},null,{"$f":"AG71*AH71+AG72*AH72+AG73*AH73+AG74*AH74","v":2.7138593461017892}]
[null,null,null,null,null,20,40,{"$f":"INDEX(MMULT(AA71:AC73,AE71:AE73),3,1)","v":0.17837760062116992},null,null,20,4,{"$f":"INDEX(MMULT(AN71:AP73,AR71:AR73),3,1)","v":8.3746987744985013E-2},null,null,null,null,null,null,1.3010299956639813,1.6020599913279623,null,{"$f":"T71^2+T72^2+T73^2+T74^2","v":6.1172622037907569},{"$f":"Y72","v":10.136788666568179},{"$f":"T71^4+T72^4+T73^4+T74^4","v":17.817064269853432},null,{"$f":"INDEX(MINVERSE(W71:Y73),3,1)","v":0.54154130109257181},{"$f":"INDEX(MINVERSE(W71:Y73),3,2)","v":-2.4808273440139748},{"$f":"INDEX(MINVERSE(W71:Y73),3,3)","v":1.2816293428421182},null,{"$f":"U71*T71^2+U72*T72^2+U73*T73^2+U74*T74^2","v":11.695772105424421},null,1.3010299956639813,0.6020599913279624,null,{"$f":"AG71^2+AG72^2+AG73^2+AG74^2","v":5.7025851953554998},{"$f":"AL72","v":8.9548392404746231},{"$f":"AG71^4+AG72^4+AG73^4+AG74^4","v":14.821665399823477},null,{"$f":"INDEX(MINVERSE(AJ71:AL73),3,1)","v":0.59252774544134124},{"$f":"INDEX(MINVERSE(AJ71:AL73),3,2)","v":-3.0376159965178964},{"$f":"INDEX(MINVERSE(AJ71:AL73),3,3)","v":1.6747391271170073},null,{"$f":"AH71*AG71^2+AH72*AG72^2+AH73*AG73^2+AH74*AG74^2","v":4.1850410876935236}]
[null,null,null,null,null,90,140,null,null,null,70,7,null,null,null,null,null,null,null,1.954242509439325,2.1461280356782382,null,null,null,null,null,null,null,null,null,null,null,1.8450980400142569,0.84509804001425681]
[]
[]
[null,null,null,null,"Secondary Batteries - Depth-of-Discharge vs. Cycle Life  "]
[]
[null,null,null,null,"Nickel-Hydrogen",null,"DOD = ",{"$f":"-28.1815/100","v":-0.28181499999999998},"log10(cycles)","+",{"$f":"168.1814/100","v":1.6818139999999999}]
[null,null,null,null,"Nickel-Cadmium",null,"DOD = ",{"$f":"-28.1815/100","v":-0.28181499999999998},"log10(cycles)","+",{"$f":"(168.1814-22.1818)/100","v":1.4599959999999998}]
[]
[]
[null,null,null,null,"Buckling Coefficient "]
[null,null,null,null,"For cylinder variable below 300",null,null,null,null,"For cylinder variable at or above 300",null,null,null," "]
[null,null,null,null,"Cylinder","Buckling","Curve Fit",null,null,"Cylinder","Buckling","Curve Fit",null,null,null,null,null,null,null,"Cylinder","Buckling",null,null,"DT D",null,null,null,"(DT D)^-1",null,null,"DT y",null,"Cylinder","Buckling",null,null,"DT D",null,null,null,"(DT D)^-1",null,null,"DT y"]
[null,null,null,null,"Variable","Coeff","Coefficients",null,null,"Variable","Coeff","Coefficients",null,null,null,null,null,null,null,"Variable","Coeff",null,null,null,null,null,null,null,null,null,null,null,"Variable","Coeff"]
[null,null,null,null,1,4,{"$f":"INDEX(MMULT(AA87:AC89,AE87:AE89),1,1)","v":0.6017184917250864},null,null,300,90,{"$f":"INDEX(MMULT(AN87:AO88,AR87:AR88),1,1)","v":-0.51024360722774986},null,null,null,null,null,null,null,{"$f":"LOG(E87)","v":0},0.6020599913279624,null,{"$f":"4","v":4},{"$f":"W88","v":6.1760912590556813},{"$f":"X88","v":13.022628786217448},null,{"$f":"INDEX(MINVERSE(W87:Y89),1,1)","v":0.99928092012534531},{"$f":"INDEX(MINVERSE(W87:Y89),2)","v":-0.96887778466405383},{"$f":"INDEX(MINVERSE(W87:Y89),3)","v":0.22935107692054904},null,{"$f":"U87+U88+U89+U90","v":5.2402496315187994},null,{"$f":"LOG(J87)","v":2.4771212547196626},1.954242509439325,null,3,{"$f":"AJ88","v":8.9542425094393252},null,null,{"$f":"INDEX(MINVERSE(AJ87:AK88),1,1)","v":18.13834224815108},{"$f":"INDEX(MINVERSE(AJ87:AK88),2)","v":-5.9653317059644682},null,null,{"$f":"AH87+AH88+AH89","v":7.380753770803901}]
[null,null,null,null,50,16.100000000000001,{"$f":"INDEX(MMULT(AA87:AC89,AE87:AE89),2,1)","v":-4.755720848801559E-2},null,null,1000,300,{"$f":"INDEX(MMULT(AN87:AO88,AR87:AR88),2,1)","v":0.99522484264780786},null,null,null,null,null,null,null,1.6989700043360187,1.2068258760318498,null,{"$f":"T87+T88+T89+T90","v":6.1760912590556813},{"$f":"W89","v":13.022628786217448},{"$f":"T87^3+T88^3+T89^3+T90^3","v":28.104012674849244},null,{"$f":"INDEX(MINVERSE(W87:Y89),2,1)","v":-0.96887778466405383},{"$f":"INDEX(MINVERSE(W87:Y89),2,2)","v":4.5101853008225978},{"$f":"INDEX(MINVERSE(W87:Y89),2,3)","v":-1.8413951029499336},null,{"$f":"T87*U87+T88*U88+T89*U89+T90*U90","v":9.8454991302828176},null,3,2.4771212547196626,null,{"$f":"AG87+AG88+AG89","v":8.9542425094393252},{"$f":"AG87^2+AG88^2+AG89^2","v":27.226501930607157},null,null,{"$f":"INDEX(MINVERSE(AJ87:AK88),2,1)","v":-5.9653317059644682},{"$f":"INDEX(MINVERSE(AJ87:AK88),2,2)","v":1.9986051415323987},null,null,{"$f":"AG87*AH87+AG88*AH88+AG89*AH89","v":22.527646101730625}]
[null,null,null,null,100,30,{"$f":"INDEX(MMULT(AA87:AC89,AE87:AE89),3,1)","v":0.24012765591352192},null,null,3000,890,null,null,null,null,null,null,null,null,2,1.4771212547196624,null,{"$f":"T87^2+T88^2+T89^2+T90^2","v":13.022628786217448},{"$f":"Y88","v":28.104012674849244},{"$f":"T87^4+T88^4+T89^4+T90^4","v":61.983964738743879},null,{"$f":"INDEX(MINVERSE(W87:Y89),3,1)","v":0.22935107692054904},{"$f":"INDEX(MINVERSE(W87:Y89),3,2)","v":-1.8413951029499331},{"$f":"INDEX(MINVERSE(W87:Y89),3,3)","v":0.8028501820753845},null,{"$f":"U87*T87^2+U88*T88^2+U89*T89^2+U90*T90^2","v":21.38347231835192},null,3.4771212547196626,2.9493900066449128]
[null,null,null,null,300,90,null,null,null,null,null,null,null,null,null,null,null,null,null,2.4771212547196626,1.954242509439325]
[]
[]
[null,null,null,null,"Inflation Factors"]
[]
[null,null,null,null,"Fiscal","Inflation","Fiscal","Inflation",null,"Fiscal","Inflation","Fiscal","Inflation",1.0169999999999999]
[null,null,null,null,"Year","Factor to","Year","Factor to",null,"Year","Factor to","Year","Factor to",1.022]
[null,null,null,null,null,"Base Year 2000",null,"Base Year 2000",null,null,"Base Year 2000",null,"Base Year 2000"]
[null,null,null,null,1981,0.51,{"$f":"E107+1","v":1991},0.83699999999999997,null,{"$f":"G107+1","v":2001},{"$f":"ROUND(H107*$N$95,3)","v":1.0169999999999999},{"$f":"J107+1","v":2011},{"$f":"K107*$N$96","v":1.2519500000000001}]
[null,null,null,null,{"$f":"E98+1","v":1982},0.55900000000000005,{"$f":"G98+1","v":1992},0.86,null,{"$f":"J98+1","v":2002},{"$f":"ROUND(K98*$N$95,3)","v":1.034},{"$f":"L98+1","v":2012},{"$f":"M98*$N$96","v":1.2794929000000002}]
[null,null,null,null,1983,0.61,1993,0.88300000000000001,null,2003,{"$f":"ROUND(K99*$N$95,3)","v":1.052},2013,1.3076417438000001]
[null,null,null,null,1984,0.65800000000000003,1994,0.90100000000000002,null,2004,{"$f":"ROUND(K100*$N$96,3)","v":1.075},2014,1.3364098621636]
[null,null,null,null,1985,0.68100000000000005,1995,0.91800000000000004,null,2005,1.099,2015,1.3658108791311994]
[null,null,null,null,1986,0.7,1996,0.93700000000000006,null,2006,1.123,2016,1.3958587184720859]
[null,null,null,null,1987,0.71899999999999997,1997,0.95799999999999996,null,2007,1.1479999999999999,2017,1.4265676102784717]
[null,null,null,null,1988,0.74,1998,0.97,null,2008,1.173,2018,1.4579520977045981]
[null,null,null,null,1989,0.77100000000000002,1999,0.98399999999999999,null,2009,1.1990000000000001,2019,1.4900270438540992]
[null,null,null,null,1990,0.80200000000000005,2000,1,null,2010,1.2250000000000001,2020,1.5228076388188894]
[]
[]
[null,null,null,null,"Small Satellite Cost Breakdown  "]
[]
[null,null,null,null,null,null,"Fraction of","Non-Recurring","Recurring",null,null,null,"C&DH Typical SLOC"]
[null,null,null,null,null,null,"S/C Bus Cost","Percentage","Percentage"]
[null,null,null,null,"Payload",null,0.4,0.6,{"$f":"1-H114","v":0.4},null,null,null,"CSC(Computer software componets)","SLOC"]
[null,null,null,null,"Spacecraft Bus",null,{"$f":"SUM(G116:G122)","v":0.99999999999999989},{"$f":"SUMPRODUCT((G116:G122),(H116:H122))","v":0.59983999999999993},{"$f":"SUMPRODUCT((G116:G122),(I116:I122))","v":0.40016000000000002},null,null,null,"Communication",1000]
[null,null,null,null,null,"ADCS",0.184,0.37,{"$f":"1-H116","v":0.63},null,null,null,"Command Processing",1000]
[null,null,null,null,null,"C&DH",0.17,0.7,0.30000000000000004,null,null,null,"Telemetry processing",1000]
[null,null,null,null,null,"Power",0.23300000000000001,0.62,0.38,null,null,null,"Telemetry processing (with compression)",3500]
[null,null,null,null,null,"Propulsion",8.4000000000000005E-2,0.5,0.5]
[null,null,null,null,null,"Structure",0.183,0.7,0.30000000000000004]
[null,null,null,null,null,"Thermal",0.02,0.5,0.5]
[null,null,null,null,null,"TT&C",0.126,0.7,0.30000000000000004]
[null,null,null,null,"Integration Assembly & Test",null,0.13900000000000001,0,1,null,null,null,"AOCS (sensors)"]
[null,null,null,null,"Program Level",null,0.22900000000000001,0.5,0.5,null,null,null,"Rate Gyro",800]
[null,null,null,null,"Ground Support Equipment",null,6.6000000000000003E-2,1,0,null,null,null,"Sun Sensor",500]
[null,null,null,null,"Launch & Orbital Ops Support",null,6.0999999999999999E-2,0,1,null,null,null,"Earth Sensor",1200]
[null,null,null,null,null,null,null,null,null,null,null,null,"Magnetormeter",200]
[null,null,null,null,null,null,null,null,null,null,null,null,"Star Tracker (no id)",400]
[null,null,null,null,"Heritage Cost Factors  ",null,null,null,null,null,null,null,"Star tracker output quaternion",2000]
[null,null,null,null,null,null,null,null,null,null,null,null,"GPS(Position/velocity)",300]
[null,null,null,null,"New design with advanced development",null,null,1.1000000000000001,null,null,null,null,"GPS(Pseudo Range)",2500]
[null,null,null,null,"Nominal new design",null,null,1]
[null,null,null,null,"Major modification to existing design",null,null,0.8]
[null,null,null,null,"Moderate modifications to existing design",null,null,0.5]
[null,null,null,null,"Basically existing design",null,null,0.2,null,null,null,null,"AOCS"]
[null,null,null,null,null,null,null,null,null,null,null,null,"Kintetik integration",2000]
[null,null,null,null,null,null,null,null,null,null,null,null,"Kalman Filter",8000]
[null,null,null,null,null,null,null,null,null,null,null,null,"Error Determination",800]
[null,null,null,null,null,null,null,null,null,null,null,null,"Process Control",3500]
[null,null,null,null,null,null,null,null,null,null,null,null,"Ephemerisis Propagator",2000]
[null,null,null,null,null,null,null,null,null,null,null,null,"Complex Ephemerisis",4000]
[null,null,null,null,null,null,null,null,null,null,null,null,"Orbit Propagator (Linear)",3000]
[null,null,null,null,null,null,null,null,null,null,null,null,"Orbit Propagator (Complex Envirolment)",8500]
[]
[]
[]
[null,null,null,null,null,null,null,null,null,null,null,null,"Actuator"]
[null,null,null,null,null,null,null,null,null,null,null,null,"Magnetic control",600]
[null,null,null,null,null,null,null,null,null,null,null,null,"Thruster Control",800]
[null,null,null,null,null,null,null,null,null,null,null,null,"Reaction wheel control",1200]
[null,null,null,null,null,null,null,null,null,null,null,null,"CMG control",1500]
[]
[]
[]
[null,null,null,null,null,null,null,null,null,null,null,null,"FDIR"]
[null,null,null,null,null,null,null,null,null,null,null,null,"Monitor",4000]
[null,null,null,null,null,null,null,null,null,null,null,null,"Fault identification",2500]
[null,null,null,null,null,null,null,null,null,null,null,null,"Fault Correction",5000]
[]
[]
[]
[null,null,null,null,null,null,null,null,null,null,null,null,"Utilites"]
[null,null,null,null,null,null,null,null,null,null,null,null,"Basic Math",800]
[null,null,null,null,null,null,null,null,null,null,null,null,"Trascendental Math",1500]
[null,null,null,null,null,null,null,null,null,null,null,null,"Matrix Math",1800]
[null,null,null,null,null,null,null,null,null,null,null,null,"Time Mng and conversion",1200]
[null,null,null,null,null,null,null,null,null,null,null,null,"Coordinate conversion",2000]
[]
[]
[]
[null,null,null,null,null,null,null,null,null,null,null,null,"Other"]
[null,null,null,null,null,null,null,null,null,null,null,null,"Momentum Mng",3000]
[null,null,null,null,null,null,null,null,null,null,null,null,"Power Mng",1200]
[null,null,null,null,null,null,null,null,null,null,null,null,"Thermal Control",800]